null
SMILES: C[C@H]1CN(CCN1S(N)(=O)=O)[C@H]1C[C@H](N(C1)C(=O)\C=C\c1cc(Cl)ccc1-n1cnnn1)C(=O)Nc1ccccc1
InChI Key: InChIKey=ZTVWUADOYUCSOA-QFRTYVPDSA-N
Activity Spreadsheet -- Enzyme Inhibition Constant Data from BindingDB
Found 12 hits for monomerid = 238257
Trg + Lig
Ki
nM
ΔG°
kcal/mole
IC50
nM
Kd
nM
EC50/IC50
nM
koff
s-1
kon
M-1s-1
pHTemp
°C
Coagulation factor XI
(Homo sapiens (Human))
BDBM238257
(US10336741, Example 57 | US10882855, Example 57 | ...)
Show SMILES C[C@H]1CN(CCN1S(N)(=O)=O)[C@H]1C[C@H](N(C1)C(=O)\C=C\c1cc(Cl)ccc1-n1cnnn1)C(=O)Nc1ccccc1 |r|
Show InChI InChI=1S/C26H30ClN9O4S/c1-18-15-33(11-12-36(18)41(28,39)40)22-14-24(26(38)30-21-5-3-2-4-6-21)34(16-22)25(37)10-7-19-13-20(27)8-9-23(19)35-17-29-31-32-35/h2-10,13,17-18,22,24H,11-12,14-16H2,1H3,(H,30,38)(H2,28,39,40)/b10-7+/t18-,22-,24-/m0/s1
Reactome pathway
US Patent
n/an/a 27n/an/an/an/an/an/a
ONO PHARMACEUTICAL CO., LTD.
US Patent
Assay Description
Human Factor XIa (Haematologic Technologies Inc.) activity was measured at an enzyme concentration of 0.1 U/mL in 150 mM NaCl, 5 mM KCl, 1 mg/mL PEG6...
US Patent US9394250 (2016)
BindingDB Entry DOI: 10.7270/Q2222SP5
Prothrombin
(Homo sapiens (Human))
BDBM238257
(US10336741, Example 57 | US10882855, Example 57 | ...)
Show SMILES C[C@H]1CN(CCN1S(N)(=O)=O)[C@H]1C[C@H](N(C1)C(=O)\C=C\c1cc(Cl)ccc1-n1cnnn1)C(=O)Nc1ccccc1 |r|
Show InChI InChI=1S/C26H30ClN9O4S/c1-18-15-33(11-12-36(18)41(28,39)40)22-14-24(26(38)30-21-5-3-2-4-6-21)34(16-22)25(37)10-7-19-13-20(27)8-9-23(19)35-17-29-31-32-35/h2-10,13,17-18,22,24H,11-12,14-16H2,1H3,(H,30,38)(H2,28,39,40)/b10-7+/t18-,22-,24-/m0/s1
US Patent
n/an/a>1.00E+5n/an/an/an/an/an/a
ONO PHARMACEUTICAL CO., LTD.
US Patent
Assay Description
Human Factor Xa (American Diagnostica Inc.) and human thrombin (Sigma) activities were measured at the enzyme concentrations of 0.18 U/mL and 0.12 U/...
US Patent US9394250 (2016)
BindingDB Entry DOI: 10.7270/Q2222SP5
Coagulation factor X
(Homo sapiens (Human))
BDBM238257
(US10336741, Example 57 | US10882855, Example 57 | ...)
Show SMILES C[C@H]1CN(CCN1S(N)(=O)=O)[C@H]1C[C@H](N(C1)C(=O)\C=C\c1cc(Cl)ccc1-n1cnnn1)C(=O)Nc1ccccc1 |r|
Show InChI InChI=1S/C26H30ClN9O4S/c1-18-15-33(11-12-36(18)41(28,39)40)22-14-24(26(38)30-21-5-3-2-4-6-21)34(16-22)25(37)10-7-19-13-20(27)8-9-23(19)35-17-29-31-32-35/h2-10,13,17-18,22,24H,11-12,14-16H2,1H3,(H,30,38)(H2,28,39,40)/b10-7+/t18-,22-,24-/m0/s1
Reactome pathway
US Patent
n/an/a>1.00E+5n/an/an/an/an/an/a
ONO PHARMACEUTICAL CO., LTD.
US Patent
Assay Description
Human Factor Xa (American Diagnostica Inc.) and human thrombin (Sigma) activities were measured at the enzyme concentrations of 0.18 U/mL and 0.12 U/...
US Patent US9394250 (2016)
BindingDB Entry DOI: 10.7270/Q2222SP5
Coagulation factor XI
(Homo sapiens (Human))
BDBM238257
(US10336741, Example 57 | US10882855, Example 57 | ...)
Show SMILES C[C@H]1CN(CCN1S(N)(=O)=O)[C@H]1C[C@H](N(C1)C(=O)\C=C\c1cc(Cl)ccc1-n1cnnn1)C(=O)Nc1ccccc1 |r|
Show InChI InChI=1S/C26H30ClN9O4S/c1-18-15-33(11-12-36(18)41(28,39)40)22-14-24(26(38)30-21-5-3-2-4-6-21)34(16-22)25(37)10-7-19-13-20(27)8-9-23(19)35-17-29-31-32-35/h2-10,13,17-18,22,24H,11-12,14-16H2,1H3,(H,30,38)(H2,28,39,40)/b10-7+/t18-,22-,24-/m0/s1
Reactome pathway
US Patent
n/an/a 27n/an/an/an/an/an/a
ONO PHARMACEUTICAL CO., LTD.
US Patent
Assay Description
Human Factor XIa (Haematologic Technologies Inc.) activity was measured at an enzyme concentration of 0.1 U/mL in 150 mM NaCl, 5 mM KCl, 1 mg/mL PEG6...
US Patent US9585881 (2017)
BindingDB Entry DOI: 10.7270/Q2D50Q0R
Prothrombin
(Homo sapiens (Human))
BDBM238257
(US10336741, Example 57 | US10882855, Example 57 | ...)
Show SMILES C[C@H]1CN(CCN1S(N)(=O)=O)[C@H]1C[C@H](N(C1)C(=O)\C=C\c1cc(Cl)ccc1-n1cnnn1)C(=O)Nc1ccccc1 |r|
Show InChI InChI=1S/C26H30ClN9O4S/c1-18-15-33(11-12-36(18)41(28,39)40)22-14-24(26(38)30-21-5-3-2-4-6-21)34(16-22)25(37)10-7-19-13-20(27)8-9-23(19)35-17-29-31-32-35/h2-10,13,17-18,22,24H,11-12,14-16H2,1H3,(H,30,38)(H2,28,39,40)/b10-7+/t18-,22-,24-/m0/s1
US Patent
n/an/a>1.00E+5n/an/an/an/an/an/a
ONO PHARMACEUTICAL CO., LTD.
US Patent
Assay Description
Human Factor Xa (American Diagnostica Inc.) and human thrombin (Sigma) activities were measured at the enzyme concentrations of 0.18 U/mL and 0.12 U/...
US Patent US9585881 (2017)
BindingDB Entry DOI: 10.7270/Q2D50Q0R
Coagulation factor X
(Homo sapiens (Human))
BDBM238257
(US10336741, Example 57 | US10882855, Example 57 | ...)
Show SMILES C[C@H]1CN(CCN1S(N)(=O)=O)[C@H]1C[C@H](N(C1)C(=O)\C=C\c1cc(Cl)ccc1-n1cnnn1)C(=O)Nc1ccccc1 |r|
Show InChI InChI=1S/C26H30ClN9O4S/c1-18-15-33(11-12-36(18)41(28,39)40)22-14-24(26(38)30-21-5-3-2-4-6-21)34(16-22)25(37)10-7-19-13-20(27)8-9-23(19)35-17-29-31-32-35/h2-10,13,17-18,22,24H,11-12,14-16H2,1H3,(H,30,38)(H2,28,39,40)/b10-7+/t18-,22-,24-/m0/s1
Reactome pathway
US Patent
n/an/a>1.00E+5n/an/an/an/an/an/a
ONO PHARMACEUTICAL CO., LTD.
US Patent
Assay Description
Human Factor Xa (American Diagnostica Inc.) and human thrombin (Sigma) activities were measured at the enzyme concentrations of 0.18 U/mL and 0.12 U/...
US Patent US10882855 (2021)
Coagulation factor XI
(Homo sapiens (Human))
BDBM238257
(US10336741, Example 57 | US10882855, Example 57 | ...)
Show SMILES C[C@H]1CN(CCN1S(N)(=O)=O)[C@H]1C[C@H](N(C1)C(=O)\C=C\c1cc(Cl)ccc1-n1cnnn1)C(=O)Nc1ccccc1 |r|
Show InChI InChI=1S/C26H30ClN9O4S/c1-18-15-33(11-12-36(18)41(28,39)40)22-14-24(26(38)30-21-5-3-2-4-6-21)34(16-22)25(37)10-7-19-13-20(27)8-9-23(19)35-17-29-31-32-35/h2-10,13,17-18,22,24H,11-12,14-16H2,1H3,(H,30,38)(H2,28,39,40)/b10-7+/t18-,22-,24-/m0/s1
Reactome pathway
US Patent
n/an/a 27n/an/an/an/an/an/a
Ono Pharmaceutical Co., Ltd
US Patent
Assay Description
Inhibitory activities of compounds of the present invention against factor XIa, Xa, XIIa, IXa, VIIa, plasma kallikrein or thrombin were evaluated usi...
US Patent US10336741 (2019)
BindingDB Entry DOI: 10.7270/Q2CR5WQP
Prothrombin
(Homo sapiens (Human))
BDBM238257
(US10336741, Example 57 | US10882855, Example 57 | ...)
Show SMILES C[C@H]1CN(CCN1S(N)(=O)=O)[C@H]1C[C@H](N(C1)C(=O)\C=C\c1cc(Cl)ccc1-n1cnnn1)C(=O)Nc1ccccc1 |r|
Show InChI InChI=1S/C26H30ClN9O4S/c1-18-15-33(11-12-36(18)41(28,39)40)22-14-24(26(38)30-21-5-3-2-4-6-21)34(16-22)25(37)10-7-19-13-20(27)8-9-23(19)35-17-29-31-32-35/h2-10,13,17-18,22,24H,11-12,14-16H2,1H3,(H,30,38)(H2,28,39,40)/b10-7+/t18-,22-,24-/m0/s1
US Patent
n/an/a>1.00E+5n/an/an/an/an/an/a
Ono Pharmaceutical Co., Ltd
US Patent
Assay Description
Inhibitory activities of compounds of the present invention against factor XIa, Xa, XIIa, IXa, VIIa, plasma kallikrein or thrombin were evaluated usi...
US Patent US10336741 (2019)
BindingDB Entry DOI: 10.7270/Q2CR5WQP
Coagulation factor X
(Homo sapiens (Human))
BDBM238257
(US10336741, Example 57 | US10882855, Example 57 | ...)
Show SMILES C[C@H]1CN(CCN1S(N)(=O)=O)[C@H]1C[C@H](N(C1)C(=O)\C=C\c1cc(Cl)ccc1-n1cnnn1)C(=O)Nc1ccccc1 |r|
Show InChI InChI=1S/C26H30ClN9O4S/c1-18-15-33(11-12-36(18)41(28,39)40)22-14-24(26(38)30-21-5-3-2-4-6-21)34(16-22)25(37)10-7-19-13-20(27)8-9-23(19)35-17-29-31-32-35/h2-10,13,17-18,22,24H,11-12,14-16H2,1H3,(H,30,38)(H2,28,39,40)/b10-7+/t18-,22-,24-/m0/s1
Reactome pathway
US Patent
n/an/a>1.00E+5n/an/an/an/an/an/a
Ono Pharmaceutical Co., Ltd
US Patent
Assay Description
Inhibitory activities of compounds of the present invention against factor XIa, Xa, XIIa, IXa, VIIa, plasma kallikrein or thrombin were evaluated usi...
US Patent US10336741 (2019)
BindingDB Entry DOI: 10.7270/Q2CR5WQP
Coagulation factor XI
(Homo sapiens (Human))
BDBM238257
(US10336741, Example 57 | US10882855, Example 57 | ...)
Show SMILES C[C@H]1CN(CCN1S(N)(=O)=O)[C@H]1C[C@H](N(C1)C(=O)\C=C\c1cc(Cl)ccc1-n1cnnn1)C(=O)Nc1ccccc1 |r|
Show InChI InChI=1S/C26H30ClN9O4S/c1-18-15-33(11-12-36(18)41(28,39)40)22-14-24(26(38)30-21-5-3-2-4-6-21)34(16-22)25(37)10-7-19-13-20(27)8-9-23(19)35-17-29-31-32-35/h2-10,13,17-18,22,24H,11-12,14-16H2,1H3,(H,30,38)(H2,28,39,40)/b10-7+/t18-,22-,24-/m0/s1
Reactome pathway
US Patent
n/an/a 27n/an/an/an/an/an/a
ONO PHARMACEUTICAL CO., LTD.
US Patent
Assay Description
Human Factor XIa (Haematologic Technologies Inc.) activity was measured at an enzyme concentration of 0.1 U/mL in 150 mM NaCl, 5 mM KCl, 1 mg/mL PEG6...
US Patent US10882855 (2021)
Prothrombin
(Homo sapiens (Human))
BDBM238257
(US10336741, Example 57 | US10882855, Example 57 | ...)
Show SMILES C[C@H]1CN(CCN1S(N)(=O)=O)[C@H]1C[C@H](N(C1)C(=O)\C=C\c1cc(Cl)ccc1-n1cnnn1)C(=O)Nc1ccccc1 |r|
Show InChI InChI=1S/C26H30ClN9O4S/c1-18-15-33(11-12-36(18)41(28,39)40)22-14-24(26(38)30-21-5-3-2-4-6-21)34(16-22)25(37)10-7-19-13-20(27)8-9-23(19)35-17-29-31-32-35/h2-10,13,17-18,22,24H,11-12,14-16H2,1H3,(H,30,38)(H2,28,39,40)/b10-7+/t18-,22-,24-/m0/s1
US Patent
n/an/a>1.00E+5n/an/an/an/an/an/a
ONO PHARMACEUTICAL CO., LTD.
US Patent
Assay Description
Human Factor Xa (American Diagnostica Inc.) and human thrombin (Sigma) activities were measured at the enzyme concentrations of 0.18 U/mL and 0.12 U/...
US Patent US10882855 (2021)
Coagulation factor X
(Homo sapiens (Human))
BDBM238257
(US10336741, Example 57 | US10882855, Example 57 | ...)
Show SMILES C[C@H]1CN(CCN1S(N)(=O)=O)[C@H]1C[C@H](N(C1)C(=O)\C=C\c1cc(Cl)ccc1-n1cnnn1)C(=O)Nc1ccccc1 |r|
Show InChI InChI=1S/C26H30ClN9O4S/c1-18-15-33(11-12-36(18)41(28,39)40)22-14-24(26(38)30-21-5-3-2-4-6-21)34(16-22)25(37)10-7-19-13-20(27)8-9-23(19)35-17-29-31-32-35/h2-10,13,17-18,22,24H,11-12,14-16H2,1H3,(H,30,38)(H2,28,39,40)/b10-7+/t18-,22-,24-/m0/s1
Reactome pathway
US Patent
n/an/a>1.00E+5n/an/an/an/an/an/a
ONO PHARMACEUTICAL CO., LTD.
US Patent
Assay Description
Human Factor Xa (American Diagnostica Inc.) and human thrombin (Sigma) activities were measured at the enzyme concentrations of 0.18 U/mL and 0.12 U/...
US Patent US9585881 (2017)
BindingDB Entry DOI: 10.7270/Q2D50Q0R