null
SMILES: CCN1CCN(Cc2ccc(NC(=O)c3ccc(C)c(NC(=O)c4cccc5c(NC(C)(C)C)nccc45)c3)cc2C(F)(F)F)CC1
InChI Key: InChIKey=QWHYQPJNCCGSET-UHFFFAOYSA-N
Activity Spreadsheet -- Enzyme Inhibition Constant Data from BindingDB
Found 1 hit for monomerid = 238349
Trg + Lig
Ki
nM
ΔG°
kcal/mole
IC50
nM
Kd
nM
EC50/IC50
nM
koff
s-1
kon
M-1s-1
pHTemp
°C
RAF proto-oncogene serine/threonine-protein kinase [Y340D,Y341D]
(Homo sapiens (Human))
BDBM238349
(US9388165, 6)
Show SMILES CCN1CCN(Cc2ccc(NC(=O)c3ccc(C)c(NC(=O)c4cccc5c(NC(C)(C)C)nccc45)c3)cc2C(F)(F)F)CC1
Show InChI InChI=1S/C36H41F3N6O2/c1-6-44-16-18-45(19-17-44)22-25-12-13-26(21-30(25)36(37,38)39)41-33(46)24-11-10-23(2)31(20-24)42-34(47)29-9-7-8-28-27(29)14-15-40-32(28)43-35(3,4)5/h7-15,20-21H,6,16-19,22H2,1-5H3,(H,40,43)(H,41,46)(H,42,47)
US Patent
n/an/a 6.40n/an/an/an/an/an/a
HANMI PHARM. CO., LTD.
US Patent
Assay Description
The compounds prepared in Examples were tested for inhibitory activities against three subtypes of RAF, i.e. RAF1 Y340D Y341D, BRAF normal type and B...
US Patent US9388165 (2016)
BindingDB Entry DOI: 10.7270/Q2F76BF9