BDBM23843 5,16,25-trimethoxy-14-oxapentacyclo[20.2.2.2^{10,13}.1^{15,19}.0^{2,7}]nonacosa-1(24),2(7),3,5,10,12,15,17,19(27),22,25,28-dodecaene::Riccardin C derivative, 19a
SMILES: COc1ccc-2c(CCc3ccc(Oc4cc(CCc5ccc-2c(OC)c5)ccc4OC)cc3)c1
InChI Key: InChIKey=CDFKRQXFXHECQG-UHFFFAOYSA-N
Data: 3 IC50
Activity Spreadsheet -- Enzyme Inhibition Constant Data from BindingDB
Found 3 hits for monomerid = 23843
Trg + Lig
Ki
nM
ΔG°
kcal/mole
IC50
nM
Kd
nM
EC50/IC50
nM
koff
s-1
kon
M-1s-1
pHTemp
°C
alpha-Glucosidase (alpha-Glu)
(Saccharomyces cerevisiae)
BDBM23843
(5,16,25-trimethoxy-14-oxapentacyclo[20.2.2.2^{10,1...)
Show SMILES COc1ccc-2c(CCc3ccc(Oc4cc(CCc5ccc-2c(OC)c5)ccc4OC)cc3)c1
Show InChI InChI=1S/C31H30O4/c1-32-26-14-16-27-24(20-26)11-6-21-7-12-25(13-8-21)35-31-19-23(10-17-29(31)33-2)5-4-22-9-15-28(27)30(18-22)34-3/h7-10,12-20H,4-6,11H2,1-3H3
Reactome pathway
n/an/a 4.90E+4n/an/an/an/a7.037
University of Tokyo
Assay Description
The alpha-glucosidase inhibitory activity of test compounds was determined in a 96-well plate format. The reaction mixture containing enzyme and chro...
Bioorg Med Chem 16: 4272-85 (2008)
Article DOI: 10.1016/j.bmc.2008.02.078
BindingDB Entry DOI: 10.7270/Q28S4N7J
Oxysterols receptor LXR-beta
(Homo sapiens (Human))
BDBM23843
(5,16,25-trimethoxy-14-oxapentacyclo[20.2.2.2^{10,1...)
Show SMILES COc1ccc-2c(CCc3ccc(Oc4cc(CCc5ccc-2c(OC)c5)ccc4OC)cc3)c1
Show InChI InChI=1S/C31H30O4/c1-32-26-14-16-27-24(20-26)11-6-21-7-12-25(13-8-21)35-31-19-23(10-17-29(31)33-2)5-4-22-9-15-28(27)30(18-22)34-3/h7-10,12-20H,4-6,11H2,1-3H3
n/an/a 1.40E+4n/an/an/an/an/an/a
University of Tokyo
Assay Description
Human embryonic kidney (HEK) 293 cells were cultured in D-MEM medium. Transfections were performed by the calcium phosphate coprecipitation method. T...
Bioorg Med Chem 16: 4272-85 (2008)
Article DOI: 10.1016/j.bmc.2008.02.078
BindingDB Entry DOI: 10.7270/Q28S4N7J
Oxysterols receptor LXR-alpha
(Homo sapiens (Human))
BDBM23843
(5,16,25-trimethoxy-14-oxapentacyclo[20.2.2.2^{10,1...)
Show SMILES COc1ccc-2c(CCc3ccc(Oc4cc(CCc5ccc-2c(OC)c5)ccc4OC)cc3)c1
Show InChI InChI=1S/C31H30O4/c1-32-26-14-16-27-24(20-26)11-6-21-7-12-25(13-8-21)35-31-19-23(10-17-29(31)33-2)5-4-22-9-15-28(27)30(18-22)34-3/h7-10,12-20H,4-6,11H2,1-3H3
n/an/a 2.00E+3n/an/an/an/an/a37
University of Tokyo
Assay Description
Human embryonic kidney (HEK) 293 cells were cultured in D-MEM medium. Transfections were performed by the calcium phosphate coprecipitation method. T...
Bioorg Med Chem 16: 4272-85 (2008)
Article DOI: 10.1016/j.bmc.2008.02.078
BindingDB Entry DOI: 10.7270/Q28S4N7J