null
SMILES: COc1ccc2CCc3ccc(cc3)-c3ccccc3CCc3ccc(Oc1c2)cc3
InChI Key: InChIKey=KPPHKUBDCAKMJR-UHFFFAOYSA-N
Activity Spreadsheet -- Enzyme Inhibition Constant Data from BindingDB
Found 3 hits for monomerid = 23847
Trg + Lig
Ki
nM
ΔG°
kcal/mole
IC50
nM
Kd
nM
EC50/IC50
nM
koff
s-1
kon
M-1s-1
pHTemp
°C
Alpha-glucosidase MAL32
(Saccharomyces cerevisiae)
BDBM23847
(16-methoxy-14-oxapentacyclo[20.2.2.2^{10,13}.1^{15...)
Show SMILES COc1ccc2CCc3ccc(cc3)-c3ccccc3CCc3ccc(Oc1c2)cc3
Show InChI InChI=1S/C29H26O2/c1-30-28-19-13-23-7-6-21-9-15-25(16-10-21)27-5-3-2-4-24(27)14-8-22-11-17-26(18-12-22)31-29(28)20-23/h2-5,9-13,15-20H,6-8,14H2,1H3
Reactome pathway
n/an/a>1.00E+5n/an/an/an/a7.037
University of Tokyo
Assay Description
The alpha-glucosidase inhibitory activity of test compounds was determined in a 96-well plate format. The reaction mixture containing enzyme and chro...
Bioorg Med Chem 16: 4272-85 (2008)
Article DOI: 10.1016/j.bmc.2008.02.078
BindingDB Entry DOI: 10.7270/Q28S4N7J
Oxysterols receptor LXR-beta
(Homo sapiens (Human))
BDBM23847
(16-methoxy-14-oxapentacyclo[20.2.2.2^{10,13}.1^{15...)
Show SMILES COc1ccc2CCc3ccc(cc3)-c3ccccc3CCc3ccc(Oc1c2)cc3
Show InChI InChI=1S/C29H26O2/c1-30-28-19-13-23-7-6-21-9-15-25(16-10-21)27-5-3-2-4-24(27)14-8-22-11-17-26(18-12-22)31-29(28)20-23/h2-5,9-13,15-20H,6-8,14H2,1H3
n/an/a 4.10E+4n/an/an/an/an/an/a
University of Tokyo
Assay Description
Human embryonic kidney (HEK) 293 cells were cultured in D-MEM medium. Transfections were performed by the calcium phosphate coprecipitation method. T...
Bioorg Med Chem 16: 4272-85 (2008)
Article DOI: 10.1016/j.bmc.2008.02.078
BindingDB Entry DOI: 10.7270/Q28S4N7J
Oxysterols receptor LXR-alpha
(Homo sapiens (Human))
BDBM23847
(16-methoxy-14-oxapentacyclo[20.2.2.2^{10,13}.1^{15...)
Show SMILES COc1ccc2CCc3ccc(cc3)-c3ccccc3CCc3ccc(Oc1c2)cc3
Show InChI InChI=1S/C29H26O2/c1-30-28-19-13-23-7-6-21-9-15-25(16-10-21)27-5-3-2-4-24(27)14-8-22-11-17-26(18-12-22)31-29(28)20-23/h2-5,9-13,15-20H,6-8,14H2,1H3
n/an/a 7.60E+3n/an/an/an/an/an/a
University of Tokyo
Assay Description
Human embryonic kidney (HEK) 293 cells were cultured in D-MEM medium. Transfections were performed by the calcium phosphate coprecipitation method. T...
Bioorg Med Chem 16: 4272-85 (2008)
Article DOI: 10.1016/j.bmc.2008.02.078
BindingDB Entry DOI: 10.7270/Q28S4N7J