BDBM23863 3-[(2S)-2-(3,3-diphenylpropanamido)-4-methylpentanamido]-2-oxo-4-phenylbutanoic acid::Peptidyl alpha-Ketoacid, 2d
SMILES: CC(C)C[C@H](NC(=O)CC(c1ccccc1)c1ccccc1)C(=O)NC(Cc1ccccc1)C(=O)C(O)=O
InChI Key: InChIKey=RBXJYCNCFOQUKN-GEVKEYJPSA-N
Data: 1 KI
Activity Spreadsheet -- Enzyme Inhibition Constant Data from BindingDB
Found 1 hit for monomerid = 23863
Trg + Lig
Ki
nM
ΔG°
kcal/mole
IC50
nM
Kd
nM
EC50/IC50
nM
koff
s-1
kon
M-1s-1
pHTemp
°C
Calpain-1
(Sus scrofa (pig))
BDBM23863
(3-[(2S)-2-(3,3-diphenylpropanamido)-4-methylpentan...)
Show SMILES CC(C)C[C@H](NC(=O)CC(c1ccccc1)c1ccccc1)C(=O)NC(Cc1ccccc1)C(=O)C(O)=O |r|
Show InChI InChI=1S/C31H34N2O5/c1-21(2)18-27(30(36)33-26(29(35)31(37)38)19-22-12-6-3-7-13-22)32-28(34)20-25(23-14-8-4-9-15-23)24-16-10-5-11-17-24/h3-17,21,25-27H,18-20H2,1-2H3,(H,32,34)(H,33,36)(H,37,38)/t26?,27-/m0/s1
Reactome pathway
63 -9.72n/an/an/an/an/a7.422
University of Tennessee Health Science Center
Assay Description
Assays were initiated by addition of CaCl2, and the increase in fluorescence (ex @370 nm, em @440 nm) was monitored. MDL28170 and buffer with 2% DMSO...
J Med Chem 51: 4346-50 (2008)
Article DOI: 10.1021/jm800182c
BindingDB Entry DOI: 10.7270/Q2542KW0