BDBM23865 3-[(2S)-2-[1-(9H-fluoren-9-yl)acetamido]-4-methylpentanamido]-2-oxo-4-phenylbutanoic acid::Peptidyl alpha-Ketoacid, 2e
SMILES: CC(C)C[C@H](NC(=O)CC1c2ccccc2-c2ccccc12)C(=O)NC(Cc1ccccc1)C(=O)C(O)=O
InChI Key: InChIKey=BSPGDQQJNKKETA-GEVKEYJPSA-N
Data: 1 KI
Activity Spreadsheet -- Enzyme Inhibition Constant Data from BindingDB
Found 1 hit for monomerid = 23865
Trg + Lig
Ki
nM
ΔG°
kcal/mole
IC50
nM
Kd
nM
EC50/IC50
nM
koff
s-1
kon
M-1s-1
pHTemp
°C
Calpain-1
(Sus scrofa (pig))
BDBM23865
(3-[(2S)-2-[1-(9H-fluoren-9-yl)acetamido]-4-methylp...)
Show SMILES CC(C)C[C@H](NC(=O)CC1c2ccccc2-c2ccccc12)C(=O)NC(Cc1ccccc1)C(=O)C(O)=O |r|
Show InChI InChI=1S/C31H32N2O5/c1-19(2)16-27(30(36)33-26(29(35)31(37)38)17-20-10-4-3-5-11-20)32-28(34)18-25-23-14-8-6-12-21(23)22-13-7-9-15-24(22)25/h3-15,19,25-27H,16-18H2,1-2H3,(H,32,34)(H,33,36)(H,37,38)/t26?,27-/m0/s1
Reactome pathway
8 -10.9n/an/an/an/an/a7.422
University of Tennessee Health Science Center
Assay Description
Assays were initiated by addition of CaCl2, and the increase in fluorescence (ex @370 nm, em @440 nm) was monitored. MDL28170 and buffer with 2% DMSO...
J Med Chem 51: 4346-50 (2008)
Article DOI: 10.1021/jm800182c
BindingDB Entry DOI: 10.7270/Q2542KW0