BDBM238859 US10052306, 298::rac-6-(2-{5-benzyl- octahydrocyclopenta[c] pyrrol-2-yl}-1- hydroxyethyl)pyridin-3- ol
SMILES: OC(CN1C[C@@H]2CC(Cc3ccccc3)C[C@@H]2C1)c1ccc(O)cn1
InChI Key: InChIKey=VMKIBZYOSZSRRE-TZKKQGAMSA-N
Data: 1 IC50
Activity Spreadsheet -- Enzyme Inhibition Constant Data from BindingDB
Found 1 hit for monomerid = 238859
Trg + Lig
Ki
nM
ΔG°
kcal/mole
IC50
nM
Kd
nM
EC50/IC50
nM
koff
s-1
kon
M-1s-1
pHTemp
°C
Glutamate receptor ionotropic, NMDA 2B
(Homo sapiens (Human))
BDBM238859
(US10052306, 298 | rac-6-(2-{5-benzyl- octahydrocyc...)
Show SMILES OC(CN1C[C@@H]2CC(Cc3ccccc3)C[C@@H]2C1)c1ccc(O)cn1 |r,w:1.0,7.7|
Show InChI InChI=1S/C21H26N2O2/c24-19-6-7-20(22-11-19)21(25)14-23-12-17-9-16(10-18(17)13-23)8-15-4-2-1-3-5-15/h1-7,11,16-18,21,24-25H,8-10,12-14H2/t16?,17-,18+,21?
NCI pathway
Reactome pathway
US Patent
n/an/a 22.4n/an/an/an/an/an/a
CADENT THERAPEUTICS, INC.
US Patent
Assay Description
To each well of the plate, 10 μL test compound, control (MK801) or HHnoCa buffer was added to a final concentration of 10 μM with a final c...
US Patent US10052306 (2018)
BindingDB Entry DOI: 10.7270/Q20R9RD3