BDBM239103 US10195181, Example 4::US9403810, 4
SMILES: Cc1c(noc1C1=CCC2(CCOC2)CC1)C(=O)Nc1c(C)n(C)n(C2CCCCC2)c1=O
InChI Key: InChIKey=VTZQGRKKFFSIKM-UHFFFAOYSA-N
Data: 2 IC50
Activity Spreadsheet -- Enzyme Inhibition Constant Data from BindingDB
Found 2 hits for monomerid = 239103
Trg + Lig
Ki
nM
ΔG°
kcal/mole
IC50
nM
Kd
nM
EC50/IC50
nM
koff
s-1
kon
M-1s-1
pHTemp
°C
E3 ubiquitin-protein ligase SMURF1
(Homo sapiens (Human))
BDBM239103
(US10195181, Example 4 | US9403810, 4)
Show SMILES Cc1c(noc1C1=CCC2(CCOC2)CC1)C(=O)Nc1c(C)n(C)n(C2CCCCC2)c1=O |t:7|
Show InChI InChI=1S/C25H34N4O4/c1-16-20(27-33-22(16)18-9-11-25(12-10-18)13-14-32-15-25)23(30)26-21-17(2)28(3)29(24(21)31)19-7-5-4-6-8-19/h9,19H,4-8,10-15H2,1-3H3,(H,26,30)
US Patent
n/an/a 100n/an/an/an/an/an/a
Novartis AG
US Patent
Assay Description
To determine the HECT E3 ligase selectivity of the compounds, a panel of biochemical HECT E3 ligase autoubiquitinylation assays was employed (Smurf-1...
US Patent US10195181 (2019)
BindingDB Entry DOI: 10.7270/Q28054Q2
HECT-type E3 ubiquitin transferase SMURF1
(Homo sapiens (Human))
BDBM239103
(US10195181, Example 4 | US9403810, 4)
Show SMILES Cc1c(noc1C1=CCC2(CCOC2)CC1)C(=O)Nc1c(C)n(C)n(C2CCCCC2)c1=O |t:7|
Show InChI InChI=1S/C25H34N4O4/c1-16-20(27-33-22(16)18-9-11-25(12-10-18)13-14-32-15-25)23(30)26-21-17(2)28(3)29(24(21)31)19-7-5-4-6-8-19/h9,19H,4-8,10-15H2,1-3H3,(H,26,30)
US Patent
n/an/a 100n/an/an/an/an/a25
Novartis AG
US Patent
Assay Description
For the biochemical assay panel, 50 nl of the test compounds, reference compounds and buffer/DMSO control are transferred to the respective wells of ...
US Patent US9403810 (2016)
BindingDB Entry DOI: 10.7270/Q22V2F1F