BDBM239106 US10195181, Example 6.1::US9403810, 6.1
SMILES: Cc1c(onc1C(=O)Nc1c(C)n(C)n(C2CCCCC2)c1=O)C1CCC(C)(C)C1
InChI Key: InChIKey=ITLLXWHDXYJGNA-UHFFFAOYSA-N
Data: 2 IC50
Activity Spreadsheet -- Enzyme Inhibition Constant Data from BindingDB
Found 2 hits for monomerid = 239106
Trg + Lig
Ki
nM
ΔG°
kcal/mole
IC50
nM
Kd
nM
EC50/IC50
nM
koff
s-1
kon
M-1s-1
pHTemp
°C
E3 ubiquitin-protein ligase SMURF1
(Homo sapiens (Human))
BDBM239106
(US10195181, Example 6.1 | US9403810, 6.1)
Show SMILES Cc1c(onc1C(=O)Nc1c(C)n(C)n(C2CCCCC2)c1=O)C1CCC(C)(C)C1
Show InChI InChI=1S/C23H34N4O3/c1-14-18(25-30-20(14)16-11-12-23(3,4)13-16)21(28)24-19-15(2)26(5)27(22(19)29)17-9-7-6-8-10-17/h16-17H,6-13H2,1-5H3,(H,24,28)
US Patent
n/an/a 23n/an/an/an/an/an/a
Novartis AG
US Patent
Assay Description
To determine the HECT E3 ligase selectivity of the compounds, a panel of biochemical HECT E3 ligase autoubiquitinylation assays was employed (Smurf-1...
US Patent US10195181 (2019)
BindingDB Entry DOI: 10.7270/Q28054Q2
HECT-type E3 ubiquitin transferase SMURF1
(Homo sapiens (Human))
BDBM239106
(US10195181, Example 6.1 | US9403810, 6.1)
Show SMILES Cc1c(onc1C(=O)Nc1c(C)n(C)n(C2CCCCC2)c1=O)C1CCC(C)(C)C1
Show InChI InChI=1S/C23H34N4O3/c1-14-18(25-30-20(14)16-11-12-23(3,4)13-16)21(28)24-19-15(2)26(5)27(22(19)29)17-9-7-6-8-10-17/h16-17H,6-13H2,1-5H3,(H,24,28)
US Patent
n/an/a 23n/an/an/an/an/a25
Novartis AG
US Patent
Assay Description
For the biochemical assay panel, 50 nl of the test compounds, reference compounds and buffer/DMSO control are transferred to the respective wells of ...
US Patent US9403810 (2016)
BindingDB Entry DOI: 10.7270/Q22V2F1F