BDBM23979 (3Z)-3-[(4-phenylbutoxy)imino]-1,2,3,4-tetrahydronaphthalen-2-amine hydrochloride::Tetralone-oxime derivative, 2f
SMILES: NC1Cc2ccccc2C\C1=N\OCCCCc1ccccc1
InChI Key: InChIKey=YQZDKAXDXJABMP-XDOYNYLZSA-N
Data: 2 KI  2 IC50
Activity Spreadsheet -- Enzyme Inhibition Constant Data from BindingDB
Found 4 hits for monomerid = 23979
Trg + Lig
Ki
nM
ΔG°
kcal/mole
IC50
nM
Kd
nM
EC50/IC50
nM
koff
s-1
kon
M-1s-1
pHTemp
°C
Leukotriene A4 hydrolase
(Homo sapiens (Human))
BDBM23979
((3Z)-3-[(4-phenylbutoxy)imino]-1,2,3,4-tetrahydron...)
Show SMILES NC1Cc2ccccc2C\C1=N\OCCCCc1ccccc1
Show InChI InChI=1S/C20H24N2O/c21-19-14-17-11-4-5-12-18(17)15-20(19)22-23-13-7-6-10-16-8-2-1-3-9-16/h1-5,8-9,11-12,19H,6-7,10,13-15,21H2/b22-20-
Reactome pathway
8.00E+3n/an/an/an/an/an/an/an/a
ENSCMu
Assay Description
Spectrophotometric assays were performed by monitoring hydrolysis of chromogenic substrate. The release of para-nitroaniline at 405 nm was measured t...
Bioorg Med Chem 14: 7241-57 (2006)
Article DOI: 10.1016/j.bmc.2006.06.050
BindingDB Entry DOI: 10.7270/Q2N29V73
Aminopeptidase N
(Sus scrofa (Pig))
BDBM23979
((3Z)-3-[(4-phenylbutoxy)imino]-1,2,3,4-tetrahydron...)
Show SMILES NC1Cc2ccccc2C\C1=N\OCCCCc1ccccc1
Show InChI InChI=1S/C20H24N2O/c21-19-14-17-11-4-5-12-18(17)15-20(19)22-23-13-7-6-10-16-8-2-1-3-9-16/h1-5,8-9,11-12,19H,6-7,10,13-15,21H2/b22-20-
5.50E+4n/an/an/an/an/an/an/an/a
ENSCMu
Assay Description
Spectrophotometric assays were performed by monitoring hydrolysis of chromogenic substrate. The release of para-nitroaniline at 405 nm was measured t...
Bioorg Med Chem 14: 7241-57 (2006)
Article DOI: 10.1016/j.bmc.2006.06.050
BindingDB Entry DOI: 10.7270/Q2N29V73
Cytosol aminopeptidase
(Bos taurus (bovine))
BDBM23979
((3Z)-3-[(4-phenylbutoxy)imino]-1,2,3,4-tetrahydron...)
Show SMILES NC1Cc2ccccc2C\C1=N\OCCCCc1ccccc1
Show InChI InChI=1S/C20H24N2O/c21-19-14-17-11-4-5-12-18(17)15-20(19)22-23-13-7-6-10-16-8-2-1-3-9-16/h1-5,8-9,11-12,19H,6-7,10,13-15,21H2/b22-20-
n/an/a>1.00E+5n/an/an/an/a8.030
ENSCMu
Assay Description
Spectrophotometric assays were performed by monitoring hydrolysis of chromogenic substrate. The release of para-nitroaniline at 405 nm was measured t...
Bioorg Med Chem 14: 7241-57 (2006)
Article DOI: 10.1016/j.bmc.2006.06.050
BindingDB Entry DOI: 10.7270/Q2N29V73
Bacterial leucyl aminopeptidase
(Vibrio proteolyticus)
BDBM23979
((3Z)-3-[(4-phenylbutoxy)imino]-1,2,3,4-tetrahydron...)
Show SMILES NC1Cc2ccccc2C\C1=N\OCCCCc1ccccc1
Show InChI InChI=1S/C20H24N2O/c21-19-14-17-11-4-5-12-18(17)15-20(19)22-23-13-7-6-10-16-8-2-1-3-9-16/h1-5,8-9,11-12,19H,6-7,10,13-15,21H2/b22-20-
n/an/a 1.10E+5n/an/an/an/a8.030
ENSCMu
Assay Description
Spectrophotometric assays were performed by monitoring hydrolysis of chromogenic substrate. The release of para-nitroaniline at 405 nm was measured t...
Bioorg Med Chem 14: 7241-57 (2006)
Article DOI: 10.1016/j.bmc.2006.06.050
BindingDB Entry DOI: 10.7270/Q2N29V73