BDBM239925 US9403767, 104::US9403767, 105
SMILES: COc1ccc(cc1)C(=O)N(C)C1(CCC(CC1)(N(C)C)c1ccccc1)c1ccccc1
InChI Key: InChIKey=IPZJSBVNBXSDFB-UHFFFAOYSA-N
Data: 4 KI
Activity Spreadsheet -- Enzyme Inhibition Constant Data from BindingDB
Found 4 hits for monomerid = 239925
Trg + Lig
Ki
nM
ΔG°
kcal/mole
IC50
nM
Kd
nM
EC50/IC50
nM
koff
s-1
kon
M-1s-1
pHTemp
°C
Nociceptin receptor
(Homo sapiens (Human))
BDBM239925
(US9403767, 104 | US9403767, 105)
Show SMILES COc1ccc(cc1)C(=O)N(C)C1(CCC(CC1)(N(C)C)c1ccccc1)c1ccccc1 |(6.66,-13.19,;7.48,-11.88,;6.75,-10.52,;7.57,-9.22,;6.85,-7.86,;5.31,-7.8,;4.49,-9.11,;5.22,-10.47,;4.59,-6.44,;5.4,-5.14,;3.05,-6.39,;3.15,-7.93,;2.32,-5.03,;3.66,-4.26,;3.66,-2.72,;2.32,-1.95,;.99,-2.72,;.99,-4.26,;1.33,-.77,;-.18,-1.04,;1.86,.68,;3.31,-.77,;2.79,.68,;3.78,1.86,;5.29,1.59,;5.82,.14,;4.83,-1.04,;1.6,-6.39,;2.42,-7.7,;1.69,-9.06,;.15,-9.11,;-.66,-7.8,;.06,-6.44,)|
Show InChI InChI=1S/C29H34N2O2/c1-30(2)28(24-11-7-5-8-12-24)19-21-29(22-20-28,25-13-9-6-10-14-25)31(3)27(32)23-15-17-26(33-4)18-16-23/h5-18H,19-22H2,1-4H3
Reactome pathway
US Patent
0.650n/an/an/an/an/an/a7.4n/a
GRUENENTHAL GMBH
US Patent
Assay Description
The compounds were examined with membranes of recombinant CHO-ORL 1 cells in a receptor binding assay with 3H-nociceptin/orphanin FQ. This test syste...
US Patent US9403767 (2016)
BindingDB Entry DOI: 10.7270/Q23R0RSJ
Mu-type opioid receptor
(Homo sapiens (Human))
BDBM239925
(US9403767, 104 | US9403767, 105)
Show SMILES COc1ccc(cc1)C(=O)N(C)C1(CCC(CC1)(N(C)C)c1ccccc1)c1ccccc1 |(6.66,-13.19,;7.48,-11.88,;6.75,-10.52,;7.57,-9.22,;6.85,-7.86,;5.31,-7.8,;4.49,-9.11,;5.22,-10.47,;4.59,-6.44,;5.4,-5.14,;3.05,-6.39,;3.15,-7.93,;2.32,-5.03,;3.66,-4.26,;3.66,-2.72,;2.32,-1.95,;.99,-2.72,;.99,-4.26,;1.33,-.77,;-.18,-1.04,;1.86,.68,;3.31,-.77,;2.79,.68,;3.78,1.86,;5.29,1.59,;5.82,.14,;4.83,-1.04,;1.6,-6.39,;2.42,-7.7,;1.69,-9.06,;.15,-9.11,;-.66,-7.8,;.06,-6.44,)|
Show InChI InChI=1S/C29H34N2O2/c1-30(2)28(24-11-7-5-8-12-24)19-21-29(22-20-28,25-13-9-6-10-14-25)31(3)27(32)23-15-17-26(33-4)18-16-23/h5-18H,19-22H2,1-4H3
NCI pathway
Reactome pathway
US Patent
1.20 -12.2n/an/an/an/an/an/a25
GRUENENTHAL GMBH
US Patent
Assay Description
The affinity to the human μ-opiate receptor was determined in a homogeneous preparation in microtiter plates. For this, dilution series of the res...
US Patent US9403767 (2016)
BindingDB Entry DOI: 10.7270/Q23R0RSJ
Mu-type opioid receptor
(Homo sapiens (Human))
BDBM239925
(US9403767, 104 | US9403767, 105)
Show SMILES COc1ccc(cc1)C(=O)N(C)C1(CCC(CC1)(N(C)C)c1ccccc1)c1ccccc1 |(6.66,-13.19,;7.48,-11.88,;6.75,-10.52,;7.57,-9.22,;6.85,-7.86,;5.31,-7.8,;4.49,-9.11,;5.22,-10.47,;4.59,-6.44,;5.4,-5.14,;3.05,-6.39,;3.15,-7.93,;2.32,-5.03,;3.66,-4.26,;3.66,-2.72,;2.32,-1.95,;.99,-2.72,;.99,-4.26,;1.33,-.77,;-.18,-1.04,;1.86,.68,;3.31,-.77,;2.79,.68,;3.78,1.86,;5.29,1.59,;5.82,.14,;4.83,-1.04,;1.6,-6.39,;2.42,-7.7,;1.69,-9.06,;.15,-9.11,;-.66,-7.8,;.06,-6.44,)|
Show InChI InChI=1S/C29H34N2O2/c1-30(2)28(24-11-7-5-8-12-24)19-21-29(22-20-28,25-13-9-6-10-14-25)31(3)27(32)23-15-17-26(33-4)18-16-23/h5-18H,19-22H2,1-4H3
NCI pathway
Reactome pathway
US Patent
10 -10.9n/an/an/an/an/an/a25
GRUENENTHAL GMBH
US Patent
Assay Description
The affinity to the human μ-opiate receptor was determined in a homogeneous preparation in microtiter plates. For this, dilution series of the res...
US Patent US9403767 (2016)
BindingDB Entry DOI: 10.7270/Q23R0RSJ
Nociceptin receptor
(Homo sapiens (Human))
BDBM239925
(US9403767, 104 | US9403767, 105)
Show SMILES COc1ccc(cc1)C(=O)N(C)C1(CCC(CC1)(N(C)C)c1ccccc1)c1ccccc1 |(6.66,-13.19,;7.48,-11.88,;6.75,-10.52,;7.57,-9.22,;6.85,-7.86,;5.31,-7.8,;4.49,-9.11,;5.22,-10.47,;4.59,-6.44,;5.4,-5.14,;3.05,-6.39,;3.15,-7.93,;2.32,-5.03,;3.66,-4.26,;3.66,-2.72,;2.32,-1.95,;.99,-2.72,;.99,-4.26,;1.33,-.77,;-.18,-1.04,;1.86,.68,;3.31,-.77,;2.79,.68,;3.78,1.86,;5.29,1.59,;5.82,.14,;4.83,-1.04,;1.6,-6.39,;2.42,-7.7,;1.69,-9.06,;.15,-9.11,;-.66,-7.8,;.06,-6.44,)|
Show InChI InChI=1S/C29H34N2O2/c1-30(2)28(24-11-7-5-8-12-24)19-21-29(22-20-28,25-13-9-6-10-14-25)31(3)27(32)23-15-17-26(33-4)18-16-23/h5-18H,19-22H2,1-4H3
Reactome pathway
US Patent
33n/an/an/an/an/an/a7.4n/a
GRUENENTHAL GMBH
US Patent
Assay Description
The compounds were examined with membranes of recombinant CHO-ORL 1 cells in a receptor binding assay with 3H-nociceptin/orphanin FQ. This test syste...
US Patent US9403767 (2016)
BindingDB Entry DOI: 10.7270/Q23R0RSJ