null
SMILES: CC(C)[C@H](CO)NC(=O)c1cc(OCC2CC2)c(Cl)cn1
InChI Key: InChIKey=KYSYCXLYUKDORD-ZDUSSCGKSA-N
Activity Spreadsheet -- Enzyme Inhibition Constant Data from BindingDB
Found 2 hits for monomerid = 240296
Trg + Lig
Ki
nM
ΔG°
kcal/mole
IC50
nM
Kd
nM
EC50/IC50
nM
koff
s-1
kon
M-1s-1
pHTemp
°C
Cannabinoid receptor 1
(Homo sapiens (Human))
BDBM240296
(US9409866, 11)
Show SMILES CC(C)[C@H](CO)NC(=O)c1cc(OCC2CC2)c(Cl)cn1 |r|
Show InChI InChI=1S/C15H21ClN2O3/c1-9(2)13(7-19)18-15(20)12-5-14(11(16)6-17-12)21-8-10-3-4-10/h5-6,9-10,13,19H,3-4,7-8H2,1-2H3,(H,18,20)/t13-/m0/s1
NCI pathway
Reactome pathway
US Patent
n/an/an/an/a>1.00E+4n/an/an/a37
HOFFMANN-LA ROCHE INC.
US Patent
Assay Description
CHO cells expressing human CB1 or CB2 receptors are seeded 17-24 hours prior to the experiment 50.000 cells per well in a black 96 well plate with fl...
US Patent US9409866 (2016)
BindingDB Entry DOI: 10.7270/Q2FX78BD
Cannabinoid receptor 2
(Homo sapiens (Human))
BDBM240296
(US9409866, 11)
Show SMILES CC(C)[C@H](CO)NC(=O)c1cc(OCC2CC2)c(Cl)cn1 |r|
Show InChI InChI=1S/C15H21ClN2O3/c1-9(2)13(7-19)18-15(20)12-5-14(11(16)6-17-12)21-8-10-3-4-10/h5-6,9-10,13,19H,3-4,7-8H2,1-2H3,(H,18,20)/t13-/m0/s1
Reactome pathway
US Patent
n/an/an/an/a 55.4n/an/an/a37
HOFFMANN-LA ROCHE INC.
US Patent
Assay Description
CHO cells expressing human CB1 or CB2 receptors are seeded 17-24 hours prior to the experiment 50.000 cells per well in a black 96 well plate with fl...
US Patent US9409866 (2016)
BindingDB Entry DOI: 10.7270/Q2FX78BD