null
SMILES: CCC[C@H](CO)NC(=O)c1cc(OCC2CC2)c(Cl)cn1
InChI Key: InChIKey=GQNFZGSYBXHJRW-LLVKDONJSA-N
Activity Spreadsheet -- Enzyme Inhibition Constant Data from BindingDB
Found 2 hits for monomerid = 240298
Trg + Lig
Ki
nM
ΔG°
kcal/mole
IC50
nM
Kd
nM
EC50/IC50
nM
koff
s-1
kon
M-1s-1
pHTemp
°C
Cannabinoid receptor 1
(Homo sapiens (Human))
BDBM240298
(US9409866, 13)
Show SMILES CCC[C@H](CO)NC(=O)c1cc(OCC2CC2)c(Cl)cn1 |r|
Show InChI InChI=1S/C15H21ClN2O3/c1-2-3-11(8-19)18-15(20)13-6-14(12(16)7-17-13)21-9-10-4-5-10/h6-7,10-11,19H,2-5,8-9H2,1H3,(H,18,20)/t11-/m1/s1
NCI pathway
Reactome pathway
US Patent
n/an/an/an/a>1.00E+4n/an/an/a37
HOFFMANN-LA ROCHE INC.
US Patent
Assay Description
CHO cells expressing human CB1 or CB2 receptors are seeded 17-24 hours prior to the experiment 50.000 cells per well in a black 96 well plate with fl...
US Patent US9409866 (2016)
BindingDB Entry DOI: 10.7270/Q2FX78BD
Cannabinoid receptor 2
(Homo sapiens (Human))
BDBM240298
(US9409866, 13)
Show SMILES CCC[C@H](CO)NC(=O)c1cc(OCC2CC2)c(Cl)cn1 |r|
Show InChI InChI=1S/C15H21ClN2O3/c1-2-3-11(8-19)18-15(20)13-6-14(12(16)7-17-13)21-9-10-4-5-10/h6-7,10-11,19H,2-5,8-9H2,1H3,(H,18,20)/t11-/m1/s1
Reactome pathway
US Patent
n/an/an/an/a 146n/an/an/a37
HOFFMANN-LA ROCHE INC.
US Patent
Assay Description
CHO cells expressing human CB1 or CB2 receptors are seeded 17-24 hours prior to the experiment 50.000 cells per well in a black 96 well plate with fl...
US Patent US9409866 (2016)
BindingDB Entry DOI: 10.7270/Q2FX78BD