null
SMILES: CC(C)(CO)CNC(=O)c1cc(OCC2CC2)c(Cl)cn1
InChI Key: InChIKey=WHEZWWWYKOUTIX-UHFFFAOYSA-N
Activity Spreadsheet -- Enzyme Inhibition Constant Data from BindingDB
Found 2 hits for monomerid = 240302
Trg + Lig
Ki
nM
ΔG°
kcal/mole
IC50
nM
Kd
nM
EC50/IC50
nM
koff
s-1
kon
M-1s-1
pHTemp
°C
Cannabinoid receptor 1
(Homo sapiens (Human))
BDBM240302
(US9409866, 17)
Show SMILES CC(C)(CO)CNC(=O)c1cc(OCC2CC2)c(Cl)cn1
Show InChI InChI=1S/C15H21ClN2O3/c1-15(2,9-19)8-18-14(20)12-5-13(11(16)6-17-12)21-7-10-3-4-10/h5-6,10,19H,3-4,7-9H2,1-2H3,(H,18,20)
NCI pathway
Reactome pathway
US Patent
n/an/an/an/a>1.00E+4n/an/an/a37
HOFFMANN-LA ROCHE INC.
US Patent
Assay Description
CHO cells expressing human CB1 or CB2 receptors are seeded 17-24 hours prior to the experiment 50.000 cells per well in a black 96 well plate with fl...
US Patent US9409866 (2016)
BindingDB Entry DOI: 10.7270/Q2FX78BD
Cannabinoid receptor 2
(Homo sapiens (Human))
BDBM240302
(US9409866, 17)
Show SMILES CC(C)(CO)CNC(=O)c1cc(OCC2CC2)c(Cl)cn1
Show InChI InChI=1S/C15H21ClN2O3/c1-15(2,9-19)8-18-14(20)12-5-13(11(16)6-17-12)21-7-10-3-4-10/h5-6,10,19H,3-4,7-9H2,1-2H3,(H,18,20)
Reactome pathway
US Patent
n/an/an/an/a 47.3n/an/an/a37
HOFFMANN-LA ROCHE INC.
US Patent
Assay Description
CHO cells expressing human CB1 or CB2 receptors are seeded 17-24 hours prior to the experiment 50.000 cells per well in a black 96 well plate with fl...
US Patent US9409866 (2016)
BindingDB Entry DOI: 10.7270/Q2FX78BD