null
SMILES: FC(F)(F)C(NC(=O)c1cc(OCC2CC2)c(cn1)C1CC1)c1ccccn1
InChI Key: InChIKey=RKWJRVCFEIUUOB-UHFFFAOYSA-N
Activity Spreadsheet -- Enzyme Inhibition Constant Data from BindingDB
Found 2 hits for monomerid = 240331
Trg + Lig
Ki
nM
ΔG°
kcal/mole
IC50
nM
Kd
nM
EC50/IC50
nM
koff
s-1
kon
M-1s-1
pHTemp
°C
Cannabinoid receptor 1
(Homo sapiens (Human))
BDBM240331
(US9409866, 46)
Show SMILES FC(F)(F)C(NC(=O)c1cc(OCC2CC2)c(cn1)C1CC1)c1ccccn1
Show InChI InChI=1S/C20H20F3N3O2/c21-20(22,23)18(15-3-1-2-8-24-15)26-19(27)16-9-17(28-11-12-4-5-12)14(10-25-16)13-6-7-13/h1-3,8-10,12-13,18H,4-7,11H2,(H,26,27)
NCI pathway
Reactome pathway
US Patent
n/an/an/an/a>1.00E+4n/an/an/a37
HOFFMANN-LA ROCHE INC.
US Patent
Assay Description
CHO cells expressing human CB1 or CB2 receptors are seeded 17-24 hours prior to the experiment 50.000 cells per well in a black 96 well plate with fl...
US Patent US9409866 (2016)
BindingDB Entry DOI: 10.7270/Q2FX78BD
Cannabinoid receptor 2
(Homo sapiens (Human))
BDBM240331
(US9409866, 46)
Show SMILES FC(F)(F)C(NC(=O)c1cc(OCC2CC2)c(cn1)C1CC1)c1ccccn1
Show InChI InChI=1S/C20H20F3N3O2/c21-20(22,23)18(15-3-1-2-8-24-15)26-19(27)16-9-17(28-11-12-4-5-12)14(10-25-16)13-6-7-13/h1-3,8-10,12-13,18H,4-7,11H2,(H,26,27)
Reactome pathway
US Patent
n/an/an/an/a 6.70n/an/an/a37
HOFFMANN-LA ROCHE INC.
US Patent
Assay Description
CHO cells expressing human CB1 or CB2 receptors are seeded 17-24 hours prior to the experiment 50.000 cells per well in a black 96 well plate with fl...
US Patent US9409866 (2016)
BindingDB Entry DOI: 10.7270/Q2FX78BD