null
SMILES: FC(F)Oc1ccc(cc1)-n1ncc(n1)C(=O)Nc1ccc(cc1)[C@H]1CNCCO1
InChI Key: InChIKey=GNSVFQNDGIQGFV-GOSISDBHSA-N
Activity Spreadsheet -- Enzyme Inhibition Constant Data from BindingDB
Found 4 hits for monomerid = 240666
Trg + Lig
Ki
nM
ΔG°
kcal/mole
IC50
nM
Kd
nM
EC50/IC50
nM
koff
s-1
kon
M-1s-1
pHTemp
°C
Trace amine-associated receptor 1
(Rattus norvegicus (Rat))
BDBM240666
(US9416127, 16 | US9416127, 3)
Show SMILES FC(F)Oc1ccc(cc1)-n1ncc(n1)C(=O)Nc1ccc(cc1)[C@H]1CNCCO1 |r|
Show InChI InChI=1S/C20H19F2N5O3/c21-20(22)30-16-7-5-15(6-8-16)27-24-11-17(26-27)19(28)25-14-3-1-13(2-4-14)18-12-23-9-10-29-18/h1-8,11,18,20,23H,9-10,12H2,(H,25,28)/t18-/m1/s1
Reactome pathway
US Patent
0.200n/an/an/an/an/an/a7.4n/a
Hoffmann-La Roche Inc.
US Patent
Assay Description
HEK-293 cells stably expressing rat TAAR1 were maintained at 37° C. and 5% CO2 in DMEM high glucose medium, containing fetal calf serum (10%, heat i...
US Patent US9416127 (2016)
BindingDB Entry DOI: 10.7270/Q22R3QK8
Trace amine-associated receptor 1
(Mus musculus (Mouse))
BDBM240666
(US9416127, 16 | US9416127, 3)
Show SMILES FC(F)Oc1ccc(cc1)-n1ncc(n1)C(=O)Nc1ccc(cc1)[C@H]1CNCCO1 |r|
Show InChI InChI=1S/C20H19F2N5O3/c21-20(22)30-16-7-5-15(6-8-16)27-24-11-17(26-27)19(28)25-14-3-1-13(2-4-14)18-12-23-9-10-29-18/h1-8,11,18,20,23H,9-10,12H2,(H,25,28)/t18-/m1/s1
Reactome pathway
US Patent
0.300 -13.5n/an/an/an/an/a7.437
Hoffmann-La Roche Inc.
US Patent
Assay Description
HEK-293 cells stably expressing mouse TAAR1 were maintained at 37° C. and 5% CO2 in DMEM high glucose medium, containing fetal calf serum (10%, h...
US Patent US9416127 (2016)
BindingDB Entry DOI: 10.7270/Q22R3QK8
Trace amine-associated receptor 1
(Mus musculus (Mouse))
BDBM240666
(US9416127, 16 | US9416127, 3)
Show SMILES FC(F)Oc1ccc(cc1)-n1ncc(n1)C(=O)Nc1ccc(cc1)[C@H]1CNCCO1 |r|
Show InChI InChI=1S/C20H19F2N5O3/c21-20(22)30-16-7-5-15(6-8-16)27-24-11-17(26-27)19(28)25-14-3-1-13(2-4-14)18-12-23-9-10-29-18/h1-8,11,18,20,23H,9-10,12H2,(H,25,28)/t18-/m1/s1
Reactome pathway
US Patent
1.5 -12.5n/an/an/an/an/a7.437
Hoffmann-La Roche Inc.
US Patent
Assay Description
HEK-293 cells stably expressing mouse TAAR1 were maintained at 37° C. and 5% CO2 in DMEM high glucose medium, containing fetal calf serum (10%, h...
US Patent US9416127 (2016)
BindingDB Entry DOI: 10.7270/Q22R3QK8
Trace amine-associated receptor 1
(Rattus norvegicus (Rat))
BDBM240666
(US9416127, 16 | US9416127, 3)
Show SMILES FC(F)Oc1ccc(cc1)-n1ncc(n1)C(=O)Nc1ccc(cc1)[C@H]1CNCCO1 |r|
Show InChI InChI=1S/C20H19F2N5O3/c21-20(22)30-16-7-5-15(6-8-16)27-24-11-17(26-27)19(28)25-14-3-1-13(2-4-14)18-12-23-9-10-29-18/h1-8,11,18,20,23H,9-10,12H2,(H,25,28)/t18-/m1/s1
Reactome pathway
US Patent
26.8n/an/an/an/an/an/a7.4n/a
Hoffmann-La Roche Inc.
US Patent
Assay Description
HEK-293 cells stably expressing rat TAAR1 were maintained at 37° C. and 5% CO2 in DMEM high glucose medium, containing fetal calf serum (10%, heat i...
US Patent US9416127 (2016)
BindingDB Entry DOI: 10.7270/Q22R3QK8