BDBM24068 3,5-diaryl-4,5-dihydropyrazole, 8b::3-(2,5-difluorophenyl)-N,5-dimethyl-5-phenyl-4,5-dihydro-1H-pyrazole-1-carboxamide
SMILES: CNC(=O)N1N=C(CC1(C)c1ccccc1)c1cc(F)ccc1F
InChI Key: InChIKey=SQGYSFDZVYSROA-UHFFFAOYSA-N
Data: 1 IC50
PDB links: 1 PDB ID contains this monomer as substructures. 1 PDB ID contains inhibitors having a similarity of 90% to this monomer.
Activity Spreadsheet -- Enzyme Inhibition Constant Data from BindingDB
Found 1 hit for monomerid = 24068
Trg + Lig
Ki
nM
ΔG°
kcal/mole
IC50
nM
Kd
nM
EC50/IC50
nM
koff
s-1
kon
M-1s-1
pHTemp
°C
A disintegrin and metalloproteinase with thrombospondin motifs 5 (ADAMTS-5)
(Homo sapiens (Human))
BDBM24068
(3,5-diaryl-4,5-dihydropyrazole, 8b | 3-(2,5-difluo...)
Show SMILES CNC(=O)N1N=C(CC1(C)c1ccccc1)c1cc(F)ccc1F |c:5|
Show InChI InChI=1S/C18H17F2N3O/c1-18(12-6-4-3-5-7-12)11-16(22-23(18)17(24)21-2)14-10-13(19)8-9-15(14)20/h3-10H,11H2,1-2H3,(H,21,24)
Reactome pathway
n/an/a 284n/an/an/an/a7.023
Merck Research Laboratories
Assay Description
The kinesin motor domain is incubated with microtubules, 1 mM ATP (1: 1 MgCl2 : Na-ATP), and compound at 23°C in buffer. After reaction was term...
Bioorg Med Chem Lett 16: 3175-9 (2006)
Article DOI: 10.1016/j.bmcl.2006.03.040
BindingDB Entry DOI: 10.7270/Q2445JTH