BDBM24079 3,5-diaryl-4,5-dihydropyrazole, 9d::4-[3-(2,5-difluorophenyl)-1-(ethylcarbamoyl)-5-phenyl-4,5-dihydro-1H-pyrazol-5-yl]-N,N-dimethylbutanamine oxide
SMILES: CCNC(=O)N1N=C(CC1(CCCC[N+](C)(C)[O-])c1ccccc1)c1cc(F)ccc1F
InChI Key: InChIKey=NWFWLXVUCFLSOQ-UHFFFAOYSA-N
Data: 1 IC50
Activity Spreadsheet -- Enzyme Inhibition Constant Data from BindingDB
Found 1 hit for monomerid = 24079
Trg + Lig
Ki
nM
ΔG°
kcal/mole
IC50
nM
Kd
nM
EC50/IC50
nM
koff
s-1
kon
M-1s-1
pHTemp
°C
A disintegrin and metalloproteinase with thrombospondin motifs 5 (ADAMTS-5)
(Homo sapiens (Human))
BDBM24079
(3,5-diaryl-4,5-dihydropyrazole, 9d | 4-[3-(2,5-dif...)
Show SMILES CCNC(=O)N1N=C(CC1(CCCC[N+](C)(C)[O-])c1ccccc1)c1cc(F)ccc1F |c:6|
Show InChI InChI=1S/C24H30F2N4O2/c1-4-27-23(31)29-24(18-10-6-5-7-11-18,14-8-9-15-30(2,3)32)17-22(28-29)20-16-19(25)12-13-21(20)26/h5-7,10-13,16H,4,8-9,14-15,17H2,1-3H3,(H,27,31)
Reactome pathway
n/an/a 585n/an/an/an/a7.023
Merck Research Laboratories
Assay Description
The kinesin motor domain is incubated with microtubules, 1 mM ATP (1: 1 MgCl2 : Na-ATP), and compound at 23°C in buffer. After reaction was term...
Bioorg Med Chem Lett 16: 3175-9 (2006)
Article DOI: 10.1016/j.bmcl.2006.03.040
BindingDB Entry DOI: 10.7270/Q2445JTH