BDBM24087 3,5-diaryl-4,5-dihydropyrazole, 10d::3-[3-(2,5-difluorophenyl)-5-phenyl-1-(piperidin-1-ylcarbonyl)-4,5-dihydro-1H-pyrazol-5-yl]propan-1-amine
SMILES: NCCCC1(CC(=NN1C(=O)N1CCCCC1)c1cc(F)ccc1F)c1ccccc1
InChI Key: InChIKey=KDIDLHQVYZHJQM-UHFFFAOYSA-N
Data: 1 IC50
Activity Spreadsheet -- Enzyme Inhibition Constant Data from BindingDB
Found 1 hit for monomerid = 24087
Trg + Lig
Ki
nM
ΔG°
kcal/mole
IC50
nM
Kd
nM
EC50/IC50
nM
koff
s-1
kon
M-1s-1
pHTemp
°C
A disintegrin and metalloproteinase with thrombospondin motifs 5 (ADAMTS-5)
(Homo sapiens (Human))
BDBM24087
(3,5-diaryl-4,5-dihydropyrazole, 10d | 3-[3-(2,5-di...)
Show SMILES NCCCC1(CC(=NN1C(=O)N1CCCCC1)c1cc(F)ccc1F)c1ccccc1 |c:6|
Show InChI InChI=1S/C24H28F2N4O/c25-19-10-11-21(26)20(16-19)22-17-24(12-7-13-27,18-8-3-1-4-9-18)30(28-22)23(31)29-14-5-2-6-15-29/h1,3-4,8-11,16H,2,5-7,12-15,17,27H2
Reactome pathway
n/an/a 85n/an/an/an/a7.023
Merck Research Laboratories
Assay Description
The kinesin motor domain is incubated with microtubules, 1 mM ATP (1: 1 MgCl2 : Na-ATP), and compound at 23°C in buffer. After reaction was term...
Bioorg Med Chem Lett 16: 3175-9 (2006)
Article DOI: 10.1016/j.bmcl.2006.03.040
BindingDB Entry DOI: 10.7270/Q2445JTH