BDBM241227 US10479788, Example 69::US9409907, 69
SMILES: COc1cc(ccc1Nc1ncc2ccnc(NC3CCOCC3)c2n1)-c1cnn(C)c1
InChI Key: InChIKey=MJPOKEITVYMJIC-UHFFFAOYSA-N
Data: 2 IC50
Activity Spreadsheet -- Enzyme Inhibition Constant Data from BindingDB
Found 3 hits for monomerid = 241227
Trg + Lig
Ki
nM
ΔG°
kcal/mole
IC50
nM
Kd
nM
EC50/IC50
nM
koff
s-1
kon
M-1s-1
pHTemp
°C
Dual specificity protein kinase TTK
(Homo sapiens (Human))
BDBM241227
(US10479788, Example 69 | US11046688, Example 69 | ...)
Show SMILES COc1cc(ccc1Nc1ncc2ccnc(NC3CCOCC3)c2n1)-c1cnn(C)c1
Show InChI InChI=1S/C23H25N7O2/c1-30-14-17(13-26-30)15-3-4-19(20(11-15)31-2)28-23-25-12-16-5-8-24-22(21(16)29-23)27-18-6-9-32-10-7-18/h3-5,8,11-14,18H,6-7,9-10H2,1-2H3,(H,24,27)(H,25,28,29)
US Patent
n/an/a 3n/an/an/an/a7.025
Cancer Research Technology Limited
US Patent
Assay Description
The enzyme reaction (total volume 10 μl) was carried out in black 384-well low volume plates containing full length MPS1 (12.5 nM or 3 nM), fluo...
US Patent US9409907 (2016)
BindingDB Entry DOI: 10.7270/Q2C24VB2
Dual specificity protein kinase TTK
(Homo sapiens (Human))
BDBM241227
(US10479788, Example 69 | US11046688, Example 69 | ...)
Show SMILES COc1cc(ccc1Nc1ncc2ccnc(NC3CCOCC3)c2n1)-c1cnn(C)c1
Show InChI InChI=1S/C23H25N7O2/c1-30-14-17(13-26-30)15-3-4-19(20(11-15)31-2)28-23-25-12-16-5-8-24-22(21(16)29-23)27-18-6-9-32-10-7-18/h3-5,8,11-14,18H,6-7,9-10H2,1-2H3,(H,24,27)(H,25,28,29)
n/an/a 3n/an/an/an/an/an/a
TBA
Citation and Details
Dual specificity protein kinase TTK
(Homo sapiens (Human))
BDBM241227
(US10479788, Example 69 | US11046688, Example 69 | ...)
Show SMILES COc1cc(ccc1Nc1ncc2ccnc(NC3CCOCC3)c2n1)-c1cnn(C)c1
Show InChI InChI=1S/C23H25N7O2/c1-30-14-17(13-26-30)15-3-4-19(20(11-15)31-2)28-23-25-12-16-5-8-24-22(21(16)29-23)27-18-6-9-32-10-7-18/h3-5,8,11-14,18H,6-7,9-10H2,1-2H3,(H,24,27)(H,25,28,29)
US Patent
n/an/a 3n/an/an/an/an/an/a
Cancer Research Technology Limited
US Patent
Assay Description
The enzyme reaction (total volume 10 μl) was carried out in black 384-well low volume plates containing full length MPS1 (12.5 nM or 3 nM), fluo...
US Patent US10479788 (2019)
BindingDB Entry DOI: 10.7270/Q2BP055X