BDBM241267 US10479788, Example 109::US9409907, 109
SMILES: COc1cc(ccc1Nc1ncc2ccnc(NCC3(C)COC3)c2n1)-c1cnn(C)c1
InChI Key: InChIKey=VWDURXWOLFFCJS-UHFFFAOYSA-N
Data: 2 IC50
Activity Spreadsheet -- Enzyme Inhibition Constant Data from BindingDB
Found 3 hits for monomerid = 241267
Trg + Lig
Ki
nM
ΔG°
kcal/mole
IC50
nM
Kd
nM
EC50/IC50
nM
koff
s-1
kon
M-1s-1
pHTemp
°C
Dual specificity protein kinase TTK
(Homo sapiens (Human))
BDBM241267
(US10479788, Example 109 | US11046688, Example 109 ...)
Show SMILES COc1cc(ccc1Nc1ncc2ccnc(NCC3(C)COC3)c2n1)-c1cnn(C)c1
Show InChI InChI=1S/C23H25N7O2/c1-23(13-32-14-23)12-26-21-20-16(6-7-24-21)9-25-22(29-20)28-18-5-4-15(8-19(18)31-3)17-10-27-30(2)11-17/h4-11H,12-14H2,1-3H3,(H,24,26)(H,25,28,29)
US Patent
n/an/a 2n/an/an/an/a7.025
Cancer Research Technology Limited
US Patent
Assay Description
The enzyme reaction (total volume 10 μl) was carried out in black 384-well low volume plates containing full length MPS1 (12.5 nM or 3 nM), fluo...
US Patent US9409907 (2016)
BindingDB Entry DOI: 10.7270/Q2C24VB2
Dual specificity protein kinase TTK
(Homo sapiens (Human))
BDBM241267
(US10479788, Example 109 | US11046688, Example 109 ...)
Show SMILES COc1cc(ccc1Nc1ncc2ccnc(NCC3(C)COC3)c2n1)-c1cnn(C)c1
Show InChI InChI=1S/C23H25N7O2/c1-23(13-32-14-23)12-26-21-20-16(6-7-24-21)9-25-22(29-20)28-18-5-4-15(8-19(18)31-3)17-10-27-30(2)11-17/h4-11H,12-14H2,1-3H3,(H,24,26)(H,25,28,29)
n/an/a 2n/an/an/an/an/an/a
TBA
Citation and Details
Dual specificity protein kinase TTK
(Homo sapiens (Human))
BDBM241267
(US10479788, Example 109 | US11046688, Example 109 ...)
Show SMILES COc1cc(ccc1Nc1ncc2ccnc(NCC3(C)COC3)c2n1)-c1cnn(C)c1
Show InChI InChI=1S/C23H25N7O2/c1-23(13-32-14-23)12-26-21-20-16(6-7-24-21)9-25-22(29-20)28-18-5-4-15(8-19(18)31-3)17-10-27-30(2)11-17/h4-11H,12-14H2,1-3H3,(H,24,26)(H,25,28,29)
US Patent
n/an/a 2n/an/an/an/an/an/a
Cancer Research Technology Limited
US Patent
Assay Description
The enzyme reaction (total volume 10 μl) was carried out in black 384-well low volume plates containing full length MPS1 (12.5 nM or 3 nM), fluo...
US Patent US10479788 (2019)
BindingDB Entry DOI: 10.7270/Q2BP055X