BDBM241291 US10479788, Example 133::US9409907, 133
SMILES: COc1cc(ccc1Nc1ncc2ccnc(N3CCC(CO)C3)c2n1)-c1cnn(C)c1
InChI Key: InChIKey=OMWXNSVMTWUXKV-UHFFFAOYSA-N
Data: 2 IC50
Activity Spreadsheet -- Enzyme Inhibition Constant Data from BindingDB
Found 3 hits for monomerid = 241291
Trg + Lig
Ki
nM
ΔG°
kcal/mole
IC50
nM
Kd
nM
EC50/IC50
nM
koff
s-1
kon
M-1s-1
pHTemp
°C
Dual specificity protein kinase TTK
(Homo sapiens (Human))
BDBM241291
(US10479788, Example 133 | US11046688, Example 133 ...)
Show SMILES COc1cc(ccc1Nc1ncc2ccnc(N3CCC(CO)C3)c2n1)-c1cnn(C)c1
Show InChI InChI=1S/C23H25N7O2/c1-29-13-18(11-26-29)16-3-4-19(20(9-16)32-2)27-23-25-10-17-5-7-24-22(21(17)28-23)30-8-6-15(12-30)14-31/h3-5,7,9-11,13,15,31H,6,8,12,14H2,1-2H3,(H,25,27,28)
US Patent
n/an/a 3n/an/an/an/a7.025
Cancer Research Technology Limited
US Patent
Assay Description
The enzyme reaction (total volume 10 μl) was carried out in black 384-well low volume plates containing full length MPS1 (12.5 nM or 3 nM), fluo...
US Patent US9409907 (2016)
BindingDB Entry DOI: 10.7270/Q2C24VB2
Dual specificity protein kinase TTK
(Homo sapiens (Human))
BDBM241291
(US10479788, Example 133 | US11046688, Example 133 ...)
Show SMILES COc1cc(ccc1Nc1ncc2ccnc(N3CCC(CO)C3)c2n1)-c1cnn(C)c1
Show InChI InChI=1S/C23H25N7O2/c1-29-13-18(11-26-29)16-3-4-19(20(9-16)32-2)27-23-25-10-17-5-7-24-22(21(17)28-23)30-8-6-15(12-30)14-31/h3-5,7,9-11,13,15,31H,6,8,12,14H2,1-2H3,(H,25,27,28)
n/an/a 3n/an/an/an/an/an/a
TBA
Citation and Details
Dual specificity protein kinase TTK
(Homo sapiens (Human))
BDBM241291
(US10479788, Example 133 | US11046688, Example 133 ...)
Show SMILES COc1cc(ccc1Nc1ncc2ccnc(N3CCC(CO)C3)c2n1)-c1cnn(C)c1
Show InChI InChI=1S/C23H25N7O2/c1-29-13-18(11-26-29)16-3-4-19(20(9-16)32-2)27-23-25-10-17-5-7-24-22(21(17)28-23)30-8-6-15(12-30)14-31/h3-5,7,9-11,13,15,31H,6,8,12,14H2,1-2H3,(H,25,27,28)
US Patent
n/an/a 3n/an/an/an/an/an/a
Cancer Research Technology Limited
US Patent
Assay Description
The enzyme reaction (total volume 10 μl) was carried out in black 384-well low volume plates containing full length MPS1 (12.5 nM or 3 nM), fluo...
US Patent US10479788 (2019)
BindingDB Entry DOI: 10.7270/Q2BP055X