BDBM241332 US10479788, Example 176::US9409907, 176
SMILES: COc1cc(ccc1Nc1ncc2ccnc(NCC(C)(C)C)c2n1)N1CCN(CC1)S(C)(=O)=O
InChI Key: InChIKey=WNPMOTKBIAYGBY-UHFFFAOYSA-N
Data: 2 IC50
Activity Spreadsheet -- Enzyme Inhibition Constant Data from BindingDB
Found 3 hits for monomerid = 241332
Trg + Lig
Ki
nM
ΔG°
kcal/mole
IC50
nM
Kd
nM
EC50/IC50
nM
koff
s-1
kon
M-1s-1
pHTemp
°C
Dual specificity protein kinase TTK
(Homo sapiens (Human))
BDBM241332
(US10479788, Example 176 | US11046688, Example 176 ...)
Show SMILES COc1cc(ccc1Nc1ncc2ccnc(NCC(C)(C)C)c2n1)N1CCN(CC1)S(C)(=O)=O
Show InChI InChI=1S/C24H33N7O3S/c1-24(2,3)16-27-22-21-17(8-9-25-22)15-26-23(29-21)28-19-7-6-18(14-20(19)34-4)30-10-12-31(13-11-30)35(5,32)33/h6-9,14-15H,10-13,16H2,1-5H3,(H,25,27)(H,26,28,29)
US Patent
n/an/a 3n/an/an/an/a7.025
Cancer Research Technology Limited
US Patent
Assay Description
The enzyme reaction (total volume 10 μl) was carried out in black 384-well low volume plates containing full length MPS1 (12.5 nM or 3 nM), fluo...
US Patent US9409907 (2016)
BindingDB Entry DOI: 10.7270/Q2C24VB2
Dual specificity protein kinase TTK
(Homo sapiens (Human))
BDBM241332
(US10479788, Example 176 | US11046688, Example 176 ...)
Show SMILES COc1cc(ccc1Nc1ncc2ccnc(NCC(C)(C)C)c2n1)N1CCN(CC1)S(C)(=O)=O
Show InChI InChI=1S/C24H33N7O3S/c1-24(2,3)16-27-22-21-17(8-9-25-22)15-26-23(29-21)28-19-7-6-18(14-20(19)34-4)30-10-12-31(13-11-30)35(5,32)33/h6-9,14-15H,10-13,16H2,1-5H3,(H,25,27)(H,26,28,29)
n/an/a 3n/an/an/an/an/an/a
TBA
Citation and Details
Dual specificity protein kinase TTK
(Homo sapiens (Human))
BDBM241332
(US10479788, Example 176 | US11046688, Example 176 ...)
Show SMILES COc1cc(ccc1Nc1ncc2ccnc(NCC(C)(C)C)c2n1)N1CCN(CC1)S(C)(=O)=O
Show InChI InChI=1S/C24H33N7O3S/c1-24(2,3)16-27-22-21-17(8-9-25-22)15-26-23(29-21)28-19-7-6-18(14-20(19)34-4)30-10-12-31(13-11-30)35(5,32)33/h6-9,14-15H,10-13,16H2,1-5H3,(H,25,27)(H,26,28,29)
US Patent
n/an/a 3n/an/an/an/an/an/a
Cancer Research Technology Limited
US Patent
Assay Description
The enzyme reaction (total volume 10 μl) was carried out in black 384-well low volume plates containing full length MPS1 (12.5 nM or 3 nM), fluo...
US Patent US10479788 (2019)
BindingDB Entry DOI: 10.7270/Q2BP055X