BDBM241335 US9409907, 179
SMILES: COc1cc(ccc1Nc1ncc2cc(C)nc(NCC(C)(C)C)c2n1)-c1nncn1C
InChI Key: InChIKey=SIBUVHVSIBBFAL-UHFFFAOYSA-N
Data: 2 KI  4 IC50
Activity Spreadsheet -- Enzyme Inhibition Constant Data from BindingDB
Found 6 hits for monomerid = 241335
Trg + Lig
Ki
nM
ΔG°
kcal/mole
IC50
nM
Kd
nM
EC50/IC50
nM
koff
s-1
kon
M-1s-1
pHTemp
°C
Dual specificity protein kinase TTK
(Homo sapiens (Human))
BDBM241335
(US9409907, 179)
Show SMILES COc1cc(ccc1Nc1ncc2cc(C)nc(NCC(C)(C)C)c2n1)-c1nncn1C
Show InChI InChI=1S/C23H28N8O/c1-14-9-16-11-24-22(29-19(16)20(27-14)25-12-23(2,3)4)28-17-8-7-15(10-18(17)32-6)21-30-26-13-31(21)5/h7-11,13H,12H2,1-6H3,(H,25,27)(H,24,28,29)
0.130n/an/an/an/an/an/an/an/a
The Institute of Cancer Research
Curated by ChEMBL
Assay Description
Inhibition of full length human N-terminal 6xHis-tagged MPS1 expressed in baculovirus expression system using 5FAM-H236 peptide as substrate after 60...
J Med Chem 61: 8226-8240 (2018)
Article DOI: 10.1021/acs.jmedchem.8b00690
BindingDB Entry DOI: 10.7270/Q2J105S9
Cyclin-Dependent Kinase 2 (CDK2)
(Homo sapiens (Human))
BDBM241335
(US9409907, 179)
Show SMILES COc1cc(ccc1Nc1ncc2cc(C)nc(NCC(C)(C)C)c2n1)-c1nncn1C
Show InChI InChI=1S/C23H28N8O/c1-14-9-16-11-24-22(29-19(16)20(27-14)25-12-23(2,3)4)28-17-8-7-15(10-18(17)32-6)21-30-26-13-31(21)5/h7-11,13H,12H2,1-6H3,(H,25,27)(H,24,28,29)
NCI pathway
Reactome pathway
65n/an/an/an/an/an/an/an/a
The Institute of Cancer Research
Curated by ChEMBL
Assay Description
Inhibition of full length human N-terminal His-tagged CDK2/cyclinA expressed in baculovirus expression system using 5FAM- peptide18 as substrate afte...
J Med Chem 61: 8226-8240 (2018)
Article DOI: 10.1021/acs.jmedchem.8b00690
BindingDB Entry DOI: 10.7270/Q2J105S9
Dual specificity protein kinase TTK
(Homo sapiens (Human))
BDBM241335
(US9409907, 179)
Show SMILES COc1cc(ccc1Nc1ncc2cc(C)nc(NCC(C)(C)C)c2n1)-c1nncn1C
Show InChI InChI=1S/C23H28N8O/c1-14-9-16-11-24-22(29-19(16)20(27-14)25-12-23(2,3)4)28-17-8-7-15(10-18(17)32-6)21-30-26-13-31(21)5/h7-11,13H,12H2,1-6H3,(H,25,27)(H,24,28,29)
n/an/a 30n/an/an/an/an/an/a
The Institute of Cancer Research
Curated by ChEMBL
Assay Description
Inhibition of MPS1 autophosphorylation at Thr33/Ser37 in human HCT116 cells after 2 hrs by MSD assay
J Med Chem 61: 8226-8240 (2018)
Article DOI: 10.1021/acs.jmedchem.8b00690
BindingDB Entry DOI: 10.7270/Q2J105S9
Cyclin-Dependent Kinase 2 (CDK2)
(Homo sapiens (Human))
BDBM241335
(US9409907, 179)
Show SMILES COc1cc(ccc1Nc1ncc2cc(C)nc(NCC(C)(C)C)c2n1)-c1nncn1C
Show InChI InChI=1S/C23H28N8O/c1-14-9-16-11-24-22(29-19(16)20(27-14)25-12-23(2,3)4)28-17-8-7-15(10-18(17)32-6)21-30-26-13-31(21)5/h7-11,13H,12H2,1-6H3,(H,25,27)(H,24,28,29)
NCI pathway
Reactome pathway
n/an/a 130n/an/an/an/an/an/a
The Institute of Cancer Research
Curated by ChEMBL
Assay Description
Inhibition of full length human N-terminal His-tagged CDK2/cyclinA expressed in baculovirus expression system using 5FAM- peptide18 as substrate afte...
J Med Chem 61: 8226-8240 (2018)
Article DOI: 10.1021/acs.jmedchem.8b00690
BindingDB Entry DOI: 10.7270/Q2J105S9
Dual specificity protein kinase TTK
(Homo sapiens (Human))
BDBM241335
(US9409907, 179)
Show SMILES COc1cc(ccc1Nc1ncc2cc(C)nc(NCC(C)(C)C)c2n1)-c1nncn1C
Show InChI InChI=1S/C23H28N8O/c1-14-9-16-11-24-22(29-19(16)20(27-14)25-12-23(2,3)4)28-17-8-7-15(10-18(17)32-6)21-30-26-13-31(21)5/h7-11,13H,12H2,1-6H3,(H,25,27)(H,24,28,29)
n/an/a 13n/an/an/an/an/an/a
The Institute of Cancer Research
Curated by ChEMBL
Assay Description
Inhibition of full length human N-terminal 6xHis-tagged MPS1 expressed in baculovirus expression system using 5FAM-H236 peptide as substrate after 60...
J Med Chem 61: 8226-8240 (2018)
Article DOI: 10.1021/acs.jmedchem.8b00690
BindingDB Entry DOI: 10.7270/Q2J105S9
Dual specificity protein kinase TTK
(Homo sapiens (Human))
BDBM241335
(US9409907, 179)
Show SMILES COc1cc(ccc1Nc1ncc2cc(C)nc(NCC(C)(C)C)c2n1)-c1nncn1C
Show InChI InChI=1S/C23H28N8O/c1-14-9-16-11-24-22(29-19(16)20(27-14)25-12-23(2,3)4)28-17-8-7-15(10-18(17)32-6)21-30-26-13-31(21)5/h7-11,13H,12H2,1-6H3,(H,25,27)(H,24,28,29)
US Patent
n/an/a 2n/an/an/an/a7.025
Cancer Research Technology Limited
US Patent
Assay Description
The enzyme reaction (total volume 10 μl) was carried out in black 384-well low volume plates containing full length MPS1 (12.5 nM or 3 nM), fluo...
US Patent US9409907 (2016)
BindingDB Entry DOI: 10.7270/Q2C24VB2