BDBM241347 US10479788, Example 191::US9409907, 191
SMILES: COc1cc(ccc1Nc1ncc2ccnc(NCC3(C)CCOC3)c2n1)-c1cn(C)nc1C
InChI Key: InChIKey=BSRQXYTWQQWQDK-UHFFFAOYSA-N
Data: 2 IC50
Activity Spreadsheet -- Enzyme Inhibition Constant Data from BindingDB
Found 3 hits for monomerid = 241347
Trg + Lig
Ki
nM
ΔG°
kcal/mole
IC50
nM
Kd
nM
EC50/IC50
nM
koff
s-1
kon
M-1s-1
pHTemp
°C
Dual specificity protein kinase TTK
(Homo sapiens (Human))
BDBM241347
(US10479788, Example 191 | US11046688, Example 191 ...)
Show SMILES COc1cc(ccc1Nc1ncc2ccnc(NCC3(C)CCOC3)c2n1)-c1cn(C)nc1C
Show InChI InChI=1S/C25H29N7O2/c1-16-19(13-32(3)31-16)17-5-6-20(21(11-17)33-4)29-24-27-12-18-7-9-26-23(22(18)30-24)28-14-25(2)8-10-34-15-25/h5-7,9,11-13H,8,10,14-15H2,1-4H3,(H,26,28)(H,27,29,30)
US Patent
n/an/a 2n/an/an/an/a7.025
Cancer Research Technology Limited
US Patent
Assay Description
The enzyme reaction (total volume 10 μl) was carried out in black 384-well low volume plates containing full length MPS1 (12.5 nM or 3 nM), fluo...
US Patent US9409907 (2016)
BindingDB Entry DOI: 10.7270/Q2C24VB2
Dual specificity protein kinase TTK
(Homo sapiens (Human))
BDBM241347
(US10479788, Example 191 | US11046688, Example 191 ...)
Show SMILES COc1cc(ccc1Nc1ncc2ccnc(NCC3(C)CCOC3)c2n1)-c1cn(C)nc1C
Show InChI InChI=1S/C25H29N7O2/c1-16-19(13-32(3)31-16)17-5-6-20(21(11-17)33-4)29-24-27-12-18-7-9-26-23(22(18)30-24)28-14-25(2)8-10-34-15-25/h5-7,9,11-13H,8,10,14-15H2,1-4H3,(H,26,28)(H,27,29,30)
n/an/a 2n/an/an/an/an/an/a
TBA
Citation and Details
Dual specificity protein kinase TTK
(Homo sapiens (Human))
BDBM241347
(US10479788, Example 191 | US11046688, Example 191 ...)
Show SMILES COc1cc(ccc1Nc1ncc2ccnc(NCC3(C)CCOC3)c2n1)-c1cn(C)nc1C
Show InChI InChI=1S/C25H29N7O2/c1-16-19(13-32(3)31-16)17-5-6-20(21(11-17)33-4)29-24-27-12-18-7-9-26-23(22(18)30-24)28-14-25(2)8-10-34-15-25/h5-7,9,11-13H,8,10,14-15H2,1-4H3,(H,26,28)(H,27,29,30)
US Patent
n/an/a 2n/an/an/an/an/an/a
Cancer Research Technology Limited
US Patent
Assay Description
The enzyme reaction (total volume 10 μl) was carried out in black 384-well low volume plates containing full length MPS1 (12.5 nM or 3 nM), fluo...
US Patent US10479788 (2019)
BindingDB Entry DOI: 10.7270/Q2BP055X