BDBM24153 N-[3-(diethylcarbamoyl)-4H,5H,6H,7H,8H-cyclohepta[b]thiophen-2-yl]thiophene-2-carboxamide::thiophene containing compound, 16
SMILES: CCN(CC)C(=O)c1c(NC(=O)c2cccs2)sc2CCCCCc12
InChI Key: InChIKey=IAIUGBGDTKFMAU-UHFFFAOYSA-N
Data: 1 IC50
Activity Spreadsheet -- Enzyme Inhibition Constant Data from BindingDB
Found 1 hit for monomerid = 24153
Trg + Lig
Ki
nM
ΔG°
kcal/mole
IC50
nM
Kd
nM
EC50/IC50
nM
koff
s-1
kon
M-1s-1
pHTemp
°C
Kinesin Spindle Protein Eg5
(Homo sapiens (Human))
BDBM24153
(N-[3-(diethylcarbamoyl)-4H,5H,6H,7H,8H-cyclohepta[...)
Show SMILES CCN(CC)C(=O)c1c(NC(=O)c2cccs2)sc2CCCCCc12
Show InChI InChI=1S/C19H24N2O2S2/c1-3-21(4-2)19(23)16-13-9-6-5-7-10-14(13)25-18(16)20-17(22)15-11-8-12-24-15/h8,11-12H,3-7,9-10H2,1-2H3,(H,20,22)
Reactome pathway
n/an/a 4.10E+3n/an/an/an/a7.022
Kalypsys, Inc.
Assay Description
KSP ATPase activity was determined by measuring production of ADP (ADPQuest Assay, DiscoverX). Raw fluorescence data were normalized to negative (DMS...
Bioorg Med Chem Lett 17: 3562-9 (2007)
Article DOI: 10.1016/j.bmcl.2007.04.076
BindingDB Entry DOI: 10.7270/Q2QV3JT8
3D
3D Structure (docked)