BDBM24158 2-N-benzene-3-N,3-N-diethyl-4,5,6,7-tetrahydro-1-benzothiophene-2,3-diamido::phenyl containing compound, 21
SMILES: CCN(CC)C(=O)c1c(NC(=O)c2ccccc2)sc2CCCCc12
InChI Key: InChIKey=HCZWWYHZJXWIEK-UHFFFAOYSA-N
Data: 1 IC50
Activity Spreadsheet -- Enzyme Inhibition Constant Data from BindingDB
Found 1 hit for monomerid = 24158
Trg + Lig
Ki
nM
ΔG°
kcal/mole
IC50
nM
Kd
nM
EC50/IC50
nM
koff
s-1
kon
M-1s-1
pHTemp
°C
Kinesin Spindle Protein Eg5
(Homo sapiens (Human))
BDBM24158
(2-N-benzene-3-N,3-N-diethyl-4,5,6,7-tetrahydro-1-b...)
Show SMILES CCN(CC)C(=O)c1c(NC(=O)c2ccccc2)sc2CCCCc12
Show InChI InChI=1S/C20H24N2O2S/c1-3-22(4-2)20(24)17-15-12-8-9-13-16(15)25-19(17)21-18(23)14-10-6-5-7-11-14/h5-7,10-11H,3-4,8-9,12-13H2,1-2H3,(H,21,23)
Reactome pathway
n/an/a 3.30E+4n/an/an/an/a7.022
Kalypsys, Inc.
Assay Description
KSP ATPase activity was determined by measuring production of ADP (ADPQuest Assay, DiscoverX). Raw fluorescence data were normalized to negative (DMS...
Bioorg Med Chem Lett 17: 3562-9 (2007)
Article DOI: 10.1016/j.bmcl.2007.04.076
BindingDB Entry DOI: 10.7270/Q2QV3JT8