null
SMILES: C(CN1CCCC1)Oc1ccc(Oc2nc3ccccc3o2)cc1
InChI Key: InChIKey=NNHHNGXLAAEJGV-UHFFFAOYSA-N
Activity Spreadsheet -- Enzyme Inhibition Constant Data from BindingDB
Found 1 hit for monomerid = 24199
Trg + Lig
Ki
nM
ΔG°
kcal/mole
IC50
nM
Kd
nM
EC50/IC50
nM
koff
s-1
kon
M-1s-1
pHTemp
°C
Leukotriene A-4 hydrolase
(Homo sapiens (Human))
BDBM24199
(2-{4-[2-(pyrrolidin-1-yl)ethoxy]phenoxy}-1,3-benzo...)
Show SMILES C(CN1CCCC1)Oc1ccc(Oc2nc3ccccc3o2)cc1
Show InChI InChI=1S/C19H20N2O3/c1-2-6-18-17(5-1)20-19(24-18)23-16-9-7-15(8-10-16)22-14-13-21-11-3-4-12-21/h1-2,5-10H,3-4,11-14H2
Reactome pathway
n/an/a 7n/an/an/an/a7.422
Johnson & Johnson Pharmaceutical
Assay Description
Recombinant human LTA4H was incubated with various concentrations of test compound for 10 min at room temperature in assay buffer, and the substrate,...
J Med Chem 51: 4150-69 (2008)
Article DOI: 10.1021/jm701575k
BindingDB Entry DOI: 10.7270/Q2GB22CX