BDBM242567 US9422240, 1-377
SMILES: CCCc1ccc(Oc2ccc(CN3CCC(O)=C(C(=O)NCC(O)=O)C3=O)cn2)cc1
InChI Key: InChIKey=CZSGNIWSDGUFPP-UHFFFAOYSA-N
Data: 1 IC50
Activity Spreadsheet -- Enzyme Inhibition Constant Data from BindingDB
Found 1 hit for monomerid = 242567
Trg + Lig
Ki
nM
ΔG°
kcal/mole
IC50
nM
Kd
nM
EC50/IC50
nM
koff
s-1
kon
M-1s-1
pHTemp
°C
Egl nine homolog 1
(Homo sapiens (Human))
BDBM242567
(US9422240, 1-377)
Show SMILES CCCc1ccc(Oc2ccc(CN3CCC(O)=C(C(=O)NCC(O)=O)C3=O)cn2)cc1 |t:17|
Show InChI InChI=1S/C23H25N3O6/c1-2-3-15-4-7-17(8-5-15)32-19-9-6-16(12-24-19)14-26-11-10-18(27)21(23(26)31)22(30)25-13-20(28)29/h4-9,12,27H,2-3,10-11,13-14H2,1H3,(H,25,30)(H,28,29)
Reactome pathway
US Patent
n/an/a 15n/an/an/an/a7.5n/a
TAISHO PHARMACEUTICAL CO., LTD
US Patent
Assay Description
The enzyme and the substrate were each diluted with a 50 mM tris-hydrochloric acid buffer (pH 7.5) containing 12.5 mM KCl, 3.75 mM MgCl2, 25 μM ...
US Patent US9422240 (2016)
BindingDB Entry DOI: 10.7270/Q24B307K