BDBM242571 US9422240, 1-392
SMILES: Cc1ccc(Oc2ncc(CN3CCC(O)=C(C(=O)NCC(O)=O)C3=O)cc2Cl)cc1
InChI Key: InChIKey=YREUWJNJZIDJON-UHFFFAOYSA-N
Data: 1 IC50
Activity Spreadsheet -- Enzyme Inhibition Constant Data from BindingDB
Found 1 hit for monomerid = 242571
Trg + Lig
Ki
nM
ΔG°
kcal/mole
IC50
nM
Kd
nM
EC50/IC50
nM
koff
s-1
kon
M-1s-1
pHTemp
°C
Egl nine homolog 1
(Homo sapiens (Human))
BDBM242571
(US9422240, 1-392)
Show SMILES Cc1ccc(Oc2ncc(CN3CCC(O)=C(C(=O)NCC(O)=O)C3=O)cc2Cl)cc1 |t:15|
Show InChI InChI=1S/C21H20ClN3O6/c1-12-2-4-14(5-3-12)31-20-15(22)8-13(9-24-20)11-25-7-6-16(26)18(21(25)30)19(29)23-10-17(27)28/h2-5,8-9,26H,6-7,10-11H2,1H3,(H,23,29)(H,27,28)
Reactome pathway
US Patent
n/an/a 26n/an/an/an/a7.5n/a
TAISHO PHARMACEUTICAL CO., LTD
US Patent
Assay Description
The enzyme and the substrate were each diluted with a 50 mM tris-hydrochloric acid buffer (pH 7.5) containing 12.5 mM KCl, 3.75 mM MgCl2, 25 μM ...
US Patent US9422240 (2016)
BindingDB Entry DOI: 10.7270/Q24B307K