BDBM242928 US9422255, 6b
SMILES: CCN[S@]1(O)C[C@](C)(NC(=N)C1(C)C)c1cc(NC(=O)c2ccc(Cl)cn2)ccc1F
InChI Key: InChIKey=LTQMYOXYKXFDQI-NRFANRHFSA-N
Data: 2 KI
Activity Spreadsheet -- Enzyme Inhibition Constant Data from BindingDB
Found 2 hits for monomerid = 242928
Trg + Lig
Ki
nM
ΔG°
kcal/mole
IC50
nM
Kd
nM
EC50/IC50
nM
koff
s-1
kon
M-1s-1
pHTemp
°C
Beta-secretase 2
(Homo sapiens (Human))
BDBM242928
(US9422255, 6b)
Show SMILES CCN[S@]1(O)C[C@](C)(NC(=N)C1(C)C)c1cc(NC(=O)c2ccc(Cl)cn2)ccc1F |r|
Show InChI InChI=1S/C21H27ClFN5O2S/c1-5-26-31(30)12-21(4,28-19(24)20(31,2)3)15-10-14(7-8-16(15)23)27-18(29)17-9-6-13(22)11-25-17/h6-11,26,30H,5,12H2,1-4H3,(H2,24,28)(H,27,29)/t21-/m0/s1
US Patent
5 -11.5n/an/an/an/an/a5.030
Merck Sharp & Dohme Corp.
US Patent
Assay Description
Inhibitor compounds, prepared at 3× the desired final concentration in 1× BACE assay buffer (20 mM sodium acetate pH 5.0, 10% glycerol, 0...
US Patent US9422255 (2016)
BindingDB Entry DOI: 10.7270/Q20P0XXS
Beta-secretase 1
(Homo sapiens (Human))
BDBM242928
(US9422255, 6b)
Show SMILES CCN[S@]1(O)C[C@](C)(NC(=N)C1(C)C)c1cc(NC(=O)c2ccc(Cl)cn2)ccc1F |r|
Show InChI InChI=1S/C21H27ClFN5O2S/c1-5-26-31(30)12-21(4,28-19(24)20(31,2)3)15-10-14(7-8-16(15)23)27-18(29)17-9-6-13(22)11-25-17/h6-11,26,30H,5,12H2,1-4H3,(H2,24,28)(H,27,29)/t21-/m0/s1
US Patent
7 -11.3n/an/an/an/an/a5.030
Merck Sharp & Dohme Corp.
US Patent
Assay Description
Varying concentrations of inhibitors at 3× the final desired concentration in a volume of 10 ul are preincubated with purified human BACE1 cata...
US Patent US9422255 (2016)
BindingDB Entry DOI: 10.7270/Q20P0XXS