BDBM243045 (3-Bromo-4,5-dimethoxyphenyl)(2,3-dibromo-5,6-dimethoxyphenyl)methanone (9)
SMILES: COc1cc(Br)c(Br)c(C(=O)c2cc(Br)c(OC)c(OC)c2)c1OC
InChI Key: InChIKey=KYFMUOWYPGJIIX-UHFFFAOYSA-N
Data: 1 IC50
Activity Spreadsheet -- Enzyme Inhibition Constant Data from BindingDB
Found 1 hit for monomerid = 243045
Trg + Lig
Ki
nM
ΔG°
kcal/mole
IC50
nM
Kd
nM
EC50/IC50
nM
koff
s-1
kon
M-1s-1
pHTemp
°C
Serum paraoxonase/arylesterase 1
(Homo sapiens (Human))
BDBM243045
((3-Bromo-4,5-dimethoxyphenyl)(2,3-dibromo-5,6-dime...)
Show SMILES COc1cc(Br)c(Br)c(C(=O)c2cc(Br)c(OC)c(OC)c2)c1OC
Show InChI InChI=1S/C17H15Br3O5/c1-22-11-6-8(5-10(19)16(11)24-3)15(21)13-14(20)9(18)7-12(23-2)17(13)25-4/h5-7H,1-4H3
n/an/a 1.25E+5n/an/an/an/an/an/a
Atatürk University
Assay Description
The enzyme assay was based on the estimation of p-nitrophenol at 412 nm. Paraoxonase activity was determined spectrophotometrically using the same pr...
J Enzyme Inhib Med Chem 28: 1073-9 (2013)
Article DOI: 10.3109/14756366.2012.715287
BindingDB Entry DOI: 10.7270/Q29W0DDQ