null
SMILES: Oc1ccc(cc1O)C(=O)c1c(O)c(O)cc(Br)c1Br
InChI Key: InChIKey=VZRYDZYWYZUQLK-UHFFFAOYSA-N
Activity Spreadsheet -- Enzyme Inhibition Constant Data from BindingDB
Found 1 hit for monomerid = 243046
Trg + Lig
Ki
nM
ΔG°
kcal/mole
IC50
nM
Kd
nM
EC50/IC50
nM
koff
s-1
kon
M-1s-1
pHTemp
°C
Serum paraoxonase/arylesterase 1
(Homo sapiens (Human))
BDBM243046
((2,3-Dibromo-5,6-dihydroxyphenyl)(3,4-dihydroxyphe...)
Show SMILES Oc1ccc(cc1O)C(=O)c1c(O)c(O)cc(Br)c1Br
Show InChI InChI=1S/C13H8Br2O5/c14-6-4-9(18)13(20)10(11(6)15)12(19)5-1-2-7(16)8(17)3-5/h1-4,16-18,20H
n/an/a 8.32E+5n/an/an/an/an/an/a
Atatürk University
Assay Description
The enzyme assay was based on the estimation of p-nitrophenol at 412 nm. Paraoxonase activity was determined spectrophotometrically using the same pr...
J Enzyme Inhib Med Chem 28: 1073-9 (2013)
Article DOI: 10.3109/14756366.2012.715287
BindingDB Entry DOI: 10.7270/Q29W0DDQ