BDBM243061 PTP inhibitor, 4m
SMILES: Cc1ccc(cc1)C1CC(=O)c2c(O)cc(O)cc2O1
InChI Key: InChIKey=FIUQSEYGBLVZQZ-UHFFFAOYSA-N
Data: 1 IC50
Activity Spreadsheet -- Enzyme Inhibition Constant Data from BindingDB
Found 1 hit for monomerid = 243061
Trg + Lig
Ki
nM
ΔG°
kcal/mole
IC50
nM
Kd
nM
EC50/IC50
nM
koff
s-1
kon
M-1s-1
pHTemp
°C
Protein-tyrosine phosphatase 1B
(Homo sapiens (Human))
BDBM243061
(PTP inhibitor, 4m)
Show SMILES Cc1ccc(cc1)C1CC(=O)c2c(O)cc(O)cc2O1
Show InChI InChI=1S/C16H14O4/c1-9-2-4-10(5-3-9)14-8-13(19)16-12(18)6-11(17)7-15(16)20-14/h2-7,14,17-18H,8H2,1H3
NCI pathway
Reactome pathway
n/an/a 1.41E+4n/an/an/an/a6.530
Yanbian University College of Pharmacy
Assay Description
Briefly, the enzymatic activity of the PTP1B catalytic domain was determinedat 30°C by monitoring the hydrolysis of pNPP. Dephosphorylation of pNPP g...
J Enzyme Inhib Med Chem 28: 1199-204 (2013)
Article DOI: 10.3109/14756366.2012.723206
BindingDB Entry DOI: 10.7270/Q2668C3G