BDBM243069 11-O-vanilloylbergenin (7)
SMILES: COc1cc(ccc1O)C(=O)OC[C@H]1OC2C(OC(=O)c3cc(O)c(OC)c(O)c23)[C@@H](O)[C@@H]1O
InChI Key: InChIKey=HELCDCXFJZSWJS-IUNOCMAUSA-N
Data: 1 IC50
Activity Spreadsheet -- Enzyme Inhibition Constant Data from BindingDB
Found 1 hit for monomerid = 243069
Trg + Lig
Ki
nM
ΔG°
kcal/mole
IC50
nM
Kd
nM
EC50/IC50
nM
koff
s-1
kon
M-1s-1
pHTemp
°C
Alpha-glucosidase MAL12
(Saccharomyces cerevisiae)
BDBM243069
(11-O-vanilloylbergenin (7))
Show SMILES COc1cc(ccc1O)C(=O)OC[C@H]1OC2C(OC(=O)c3cc(O)c(OC)c(O)c23)[C@@H](O)[C@@H]1O |r|
Show InChI InChI=1S/C22H22O12/c1-30-12-5-8(3-4-10(12)23)21(28)32-7-13-15(25)17(27)20-19(33-13)14-9(22(29)34-20)6-11(24)18(31-2)16(14)26/h3-6,13,15,17,19-20,23-27H,7H2,1-2H3/t13-,15-,17+,19?,20?/m1/s1
Reactome pathway
n/an/a 1.87E+5n/an/an/an/a7.025
Kinki University
Assay Description
α-glucosidase (25 μL, 0.2 U/mL), 25 μL of various concentrations of samples, and 175 μL of 50 mM sodium phosphate buffer (pH 7.0)...
J Enzyme Inhib Med Chem 28: 1162-70 (2013)
Article DOI: 10.3109/14756366.2012.719503
BindingDB Entry DOI: 10.7270/Q22F7MCR