BDBM243121 (R)-N-(1-(3,4-Dihydroisoquinolin- 2(1H)-yl)propan-2-yl)-4-(5- (trifluoromethyl)-1,2,4-oxadiazol-3- yl)benzamide::US10053434, 7
SMILES: C[C@H](CN1CCc2ccccc2C1)NC(=O)c1ccc(cc1)-c1noc(n1)C(F)(F)F
InChI Key: InChIKey=OYXHJSOZEXCCIB-CQSZACIVSA-N
Data: 1 IC50
Activity Spreadsheet -- Enzyme Inhibition Constant Data from BindingDB
Found 1 hit for monomerid = 243121
Trg + Lig
Ki
nM
ΔG°
kcal/mole
IC50
nM
Kd
nM
EC50/IC50
nM
koff
s-1
kon
M-1s-1
pHTemp
°C
HDAC4
(Homo sapiens (Human))
BDBM243121
((R)-N-(1-(3,4-Dihydroisoquinolin- 2(1H)-yl)propan-...)
Show SMILES C[C@H](CN1CCc2ccccc2C1)NC(=O)c1ccc(cc1)-c1noc(n1)C(F)(F)F |r|
Show InChI InChI=1S/C22H21F3N4O2/c1-14(12-29-11-10-15-4-2-3-5-18(15)13-29)26-20(30)17-8-6-16(7-9-17)19-27-21(31-28-19)22(23,24)25/h2-9,14H,10-13H2,1H3,(H,26,30)/t14-/m1/s1
US Patent
n/an/a 9n/an/an/an/an/an/a
CHDI FOUNDATION, INC.
US Patent
Assay Description
5 μL of each solution of 1:20 diluted compound from above was transferred to a clear bottomed, black, 384-well assay plate using the Bravo or th...
US Patent US10053434 (2018)
BindingDB Entry DOI: 10.7270/Q2MG7RJZ