BDBM243152 D1: N-((R)-1-((abs)-3- (Difluoromethoxy)piperidin-1- yl)propan-2-yl)-4-(5-(trifluoromethyl)- 1,2,4-oxadiazol-3-yl)benzamide::US10053434, 10::US10053434, 9
SMILES: C[C@H](CN1CCCC(C1)OC(F)F)NC(=O)c1ccc(cc1)-c1noc(n1)C(F)(F)F
InChI Key: InChIKey=YOGWQNKZBZCDFV-YNODCEANSA-N
Data: 2 IC50
Activity Spreadsheet -- Enzyme Inhibition Constant Data from BindingDB
Found 2 hits for monomerid = 243152
Trg + Lig
Ki
nM
ΔG°
kcal/mole
IC50
nM
Kd
nM
EC50/IC50
nM
koff
s-1
kon
M-1s-1
pHTemp
°C
HDAC4
(Homo sapiens (Human))
BDBM243152
(D1: N-((R)-1-((abs)-3- (Difluoromethoxy)piperidin-...)
Show SMILES C[C@H](CN1CCCC(C1)OC(F)F)NC(=O)c1ccc(cc1)-c1noc(n1)C(F)(F)F |r|
Show InChI InChI=1S/C19H21F5N4O3/c1-11(9-28-8-2-3-14(10-28)30-18(20)21)25-16(29)13-6-4-12(5-7-13)15-26-17(31-27-15)19(22,23)24/h4-7,11,14,18H,2-3,8-10H2,1H3,(H,25,29)/t11-,14?/m1/s1
US Patent
n/an/a 3n/an/an/an/an/an/a
CHDI FOUNDATION, INC.
US Patent
Assay Description
5 μL of each solution of 1:20 diluted compound from above was transferred to a clear bottomed, black, 384-well assay plate using the Bravo or th...
US Patent US10053434 (2018)
BindingDB Entry DOI: 10.7270/Q2MG7RJZ
HDAC4
(Homo sapiens (Human))
BDBM243152
(D1: N-((R)-1-((abs)-3- (Difluoromethoxy)piperidin-...)
Show SMILES C[C@H](CN1CCCC(C1)OC(F)F)NC(=O)c1ccc(cc1)-c1noc(n1)C(F)(F)F |r|
Show InChI InChI=1S/C19H21F5N4O3/c1-11(9-28-8-2-3-14(10-28)30-18(20)21)25-16(29)13-6-4-12(5-7-13)15-26-17(31-27-15)19(22,23)24/h4-7,11,14,18H,2-3,8-10H2,1H3,(H,25,29)/t11-,14?/m1/s1
US Patent
n/an/a 21n/an/an/an/an/an/a
CHDI FOUNDATION, INC.
US Patent
Assay Description
5 μL of each solution of 1:20 diluted compound from above was transferred to a clear bottomed, black, 384-well assay plate using the Bravo or th...
US Patent US10053434 (2018)
BindingDB Entry DOI: 10.7270/Q2MG7RJZ