BDBM243193 D1: N-((R)-1-((abs-1,5-cis)-6- Azabicyclo[3.2.0]heptan-6-yl)propan-2- yl)-4-(5-(trifluoromethyl)-1,2,4- oxadiazol-3-yl)benzamide::US10053434, 20::US10053434, 21
SMILES: C[C@H](CN1CC2CCCC12)NC(=O)c1ccc(cc1)-c1noc(n1)C(F)(F)F
InChI Key: InChIKey=OGIDUHARCQQJFV-VCANKDNSSA-N
Data: 2 IC50
Activity Spreadsheet -- Enzyme Inhibition Constant Data from BindingDB
Found 2 hits for monomerid = 243193
Trg + Lig
Ki
nM
ΔG°
kcal/mole
IC50
nM
Kd
nM
EC50/IC50
nM
koff
s-1
kon
M-1s-1
pHTemp
°C
HDAC4
(Homo sapiens (Human))
BDBM243193
(D1: N-((R)-1-((abs-1,5-cis)-6- Azabicyclo[3.2.0]he...)
Show SMILES C[C@H](CN1CC2CCCC12)NC(=O)c1ccc(cc1)-c1noc(n1)C(F)(F)F |r|
Show InChI InChI=1S/C19H21F3N4O2/c1-11(9-26-10-14-3-2-4-15(14)26)23-17(27)13-7-5-12(6-8-13)16-24-18(28-25-16)19(20,21)22/h5-8,11,14-15H,2-4,9-10H2,1H3,(H,23,27)/t11-,14?,15?/m1/s1
US Patent
n/an/a 4n/an/an/an/an/an/a
CHDI FOUNDATION, INC.
US Patent
Assay Description
5 μL of each solution of 1:20 diluted compound from above was transferred to a clear bottomed, black, 384-well assay plate using the Bravo or th...
US Patent US10053434 (2018)
BindingDB Entry DOI: 10.7270/Q2MG7RJZ
HDAC4
(Homo sapiens (Human))
BDBM243193
(D1: N-((R)-1-((abs-1,5-cis)-6- Azabicyclo[3.2.0]he...)
Show SMILES C[C@H](CN1CC2CCCC12)NC(=O)c1ccc(cc1)-c1noc(n1)C(F)(F)F |r|
Show InChI InChI=1S/C19H21F3N4O2/c1-11(9-26-10-14-3-2-4-15(14)26)23-17(27)13-7-5-12(6-8-13)16-24-18(28-25-16)19(20,21)22/h5-8,11,14-15H,2-4,9-10H2,1H3,(H,23,27)/t11-,14?,15?/m1/s1
US Patent
n/an/a 22n/an/an/an/an/an/a
CHDI FOUNDATION, INC.
US Patent
Assay Description
5 μL of each solution of 1:20 diluted compound from above was transferred to a clear bottomed, black, 384-well assay plate using the Bravo or th...
US Patent US10053434 (2018)
BindingDB Entry DOI: 10.7270/Q2MG7RJZ