null
SMILES: FC(F)(F)c1ccnc(Nc2cccc(c2)-c2cnc(o2)N2CCNC(=O)C22CCC2)n1
InChI Key: InChIKey=HESYECZDAQQIHR-UHFFFAOYSA-N
Activity Spreadsheet -- Enzyme Inhibition Constant Data from BindingDB
Found 1 hit for monomerid = 243360
Trg + Lig
Ki
nM
ΔG°
kcal/mole
IC50
nM
Kd
nM
EC50/IC50
nM
koff
s-1
kon
M-1s-1
pHTemp
°C
Tyrosine-protein kinase SYK
(Homo sapiens (Human))
BDBM243360
(5-{5-[3-(4- Trifluoromethyl- pyrimidin-2-ylamino)-...)
Show SMILES FC(F)(F)c1ccnc(Nc2cccc(c2)-c2cnc(o2)N2CCNC(=O)C22CCC2)n1
Show InChI InChI=1S/C21H19F3N6O2/c22-21(23,24)16-5-8-26-18(29-16)28-14-4-1-3-13(11-14)15-12-27-19(32-15)30-10-9-25-17(31)20(30)6-2-7-20/h1,3-5,8,11-12H,2,6-7,9-10H2,(H,25,31)(H,26,28,29)
NCI pathway
Reactome pathway
US Patent
n/an/a<500n/an/an/an/a7.825
AB SCIENCE
US Patent
Assay Description
SYK kinase was purified as a full length protein in a baculovirus system near homogeneity. All kinase assays were performed with the Kinase TK (tyros...
US Patent US10053455 (2018)
BindingDB Entry DOI: 10.7270/Q27946PV