BDBM243362 4-{5-[2-Fluoro-5-(4- methyl-pyrimidin-2- ylamino)-phenyl]-oxazol- 2-yl}-4,7-diaza- spiro[2.5]octan-8-one::US10053455, 018
SMILES: Cc1ccnc(Nc2ccc(F)c(c2)-c2cnc(o2)N2CCNC(=O)C22CC2)n1
InChI Key: InChIKey=IDDOQLIIYBDYJY-UHFFFAOYSA-N
Data: 1 IC50
Activity Spreadsheet -- Enzyme Inhibition Constant Data from BindingDB
Found 1 hit for monomerid = 243362
Trg + Lig
Ki
nM
ΔG°
kcal/mole
IC50
nM
Kd
nM
EC50/IC50
nM
koff
s-1
kon
M-1s-1
pHTemp
°C
Tyrosine-protein kinase SYK
(Homo sapiens (Human))
BDBM243362
(4-{5-[2-Fluoro-5-(4- methyl-pyrimidin-2- ylamino)-...)
Show SMILES Cc1ccnc(Nc2ccc(F)c(c2)-c2cnc(o2)N2CCNC(=O)C22CC2)n1
Show InChI InChI=1S/C20H19FN6O2/c1-12-4-7-23-18(25-12)26-13-2-3-15(21)14(10-13)16-11-24-19(29-16)27-9-8-22-17(28)20(27)5-6-20/h2-4,7,10-11H,5-6,8-9H2,1H3,(H,22,28)(H,23,25,26)
NCI pathway
Reactome pathway
US Patent
n/an/a<500n/an/an/an/a7.825
AB SCIENCE
US Patent
Assay Description
SYK kinase was purified as a full length protein in a baculovirus system near homogeneity. All kinase assays were performed with the Kinase TK (tyros...
US Patent US10053455 (2018)
BindingDB Entry DOI: 10.7270/Q27946PV