null
SMILES: Fc1ccc(nc1)C(=O)Nc1cccc(CN2CCC(CC2)C(=O)NC2CCCCC2)c1
InChI Key: InChIKey=KVLAYYUNANBXPC-UHFFFAOYSA-N
Activity Spreadsheet -- Enzyme Inhibition Constant Data from BindingDB
Found 1 hit for monomerid = 243632
Trg + Lig
Ki
nM
ΔG°
kcal/mole
IC50
nM
Kd
nM
EC50/IC50
nM
koff
s-1
kon
M-1s-1
pHTemp
°C
Atypical chemokine receptor 3
(Homo sapiens (Human))
BDBM243632
(US9428456, 1.057)
Show SMILES Fc1ccc(nc1)C(=O)Nc1cccc(CN2CCC(CC2)C(=O)NC2CCCCC2)c1
Show InChI InChI=1S/C25H31FN4O2/c26-20-9-10-23(27-16-20)25(32)29-22-8-4-5-18(15-22)17-30-13-11-19(12-14-30)24(31)28-21-6-2-1-3-7-21/h4-5,8-10,15-16,19,21H,1-3,6-7,11-14,17H2,(H,28,31)(H,29,32)
US Patent
n/an/an/an/a 0.800n/an/an/a37
ACTELION PHARMACEUTICALS LTD
US Patent
Assay Description
CHO-K1 CXCR7 b-arrestin cells are detached from culture dishes with a cell dissociation buffer (Invitrogen, #13151-014) and collected in growing medi...
US Patent US9428456 (2016)
BindingDB Entry DOI: 10.7270/Q29022PZ