null
SMILES: CC(C)(C)NC(=O)C1CCN(Cc2cccc(NC(=O)c3ccc(Cl)cn3)c2)CC1
InChI Key: InChIKey=QJHYSOMCENSKJQ-UHFFFAOYSA-N
Activity Spreadsheet -- Enzyme Inhibition Constant Data from BindingDB
Found 1 hit for monomerid = 243721
Trg + Lig
Ki
nM
ΔG°
kcal/mole
IC50
nM
Kd
nM
EC50/IC50
nM
koff
s-1
kon
M-1s-1
pHTemp
°C
Atypical chemokine receptor 3
(Homo sapiens (Human))
BDBM243721
(US9428456, 1.339)
Show SMILES CC(C)(C)NC(=O)C1CCN(Cc2cccc(NC(=O)c3ccc(Cl)cn3)c2)CC1
Show InChI InChI=1S/C23H29ClN4O2/c1-23(2,3)27-21(29)17-9-11-28(12-10-17)15-16-5-4-6-19(13-16)26-22(30)20-8-7-18(24)14-25-20/h4-8,13-14,17H,9-12,15H2,1-3H3,(H,26,30)(H,27,29)
US Patent
n/an/an/an/a 0.600n/an/an/a37
ACTELION PHARMACEUTICALS LTD
US Patent
Assay Description
CHO-K1 CXCR7 b-arrestin cells are detached from culture dishes with a cell dissociation buffer (Invitrogen, #13151-014) and collected in growing medi...
US Patent US9428456 (2016)
BindingDB Entry DOI: 10.7270/Q29022PZ