null
SMILES: Fc1ccc(cc1)C(=O)Nc1cccc(CN2CCC(CC2)C(=O)NC2CCCC2)c1
InChI Key: InChIKey=VYIMDXFKDRCESX-UHFFFAOYSA-N
Activity Spreadsheet -- Enzyme Inhibition Constant Data from BindingDB
Found 1 hit for monomerid = 243777
Trg + Lig
Ki
nM
ΔG°
kcal/mole
IC50
nM
Kd
nM
EC50/IC50
nM
koff
s-1
kon
M-1s-1
pHTemp
°C
Atypical chemokine receptor 3
(Homo sapiens (Human))
BDBM243777
(US9428456, 1.206)
Show SMILES Fc1ccc(cc1)C(=O)Nc1cccc(CN2CCC(CC2)C(=O)NC2CCCC2)c1
Show InChI InChI=1S/C25H30FN3O2/c26-21-10-8-19(9-11-21)24(30)28-23-7-3-4-18(16-23)17-29-14-12-20(13-15-29)25(31)27-22-5-1-2-6-22/h3-4,7-11,16,20,22H,1-2,5-6,12-15,17H2,(H,27,31)(H,28,30)
US Patent
n/an/an/an/a 0.900n/an/an/a37
ACTELION PHARMACEUTICALS LTD
US Patent
Assay Description
CHO-K1 CXCR7 b-arrestin cells are detached from culture dishes with a cell dissociation buffer (Invitrogen, #13151-014) and collected in growing medi...
US Patent US9428456 (2016)
BindingDB Entry DOI: 10.7270/Q29022PZ