null
SMILES: FC(F)(F)c1cncc(c1)C(=O)Nc1ccc(Cl)c(CN2CCC(CC2)C(=O)NC2CCCC2)c1
InChI Key: InChIKey=XGLOUUCYALYPDG-UHFFFAOYSA-N
Activity Spreadsheet -- Enzyme Inhibition Constant Data from BindingDB
Found 1 hit for monomerid = 243796
Trg + Lig
Ki
nM
ΔG°
kcal/mole
IC50
nM
Kd
nM
EC50/IC50
nM
koff
s-1
kon
M-1s-1
pHTemp
°C
Atypical chemokine receptor 3
(Homo sapiens (Human))
BDBM243796
(US9428456, 1.225)
Show SMILES FC(F)(F)c1cncc(c1)C(=O)Nc1ccc(Cl)c(CN2CCC(CC2)C(=O)NC2CCCC2)c1
Show InChI InChI=1S/C25H28ClF3N4O2/c26-22-6-5-21(32-24(35)17-11-19(14-30-13-17)25(27,28)29)12-18(22)15-33-9-7-16(8-10-33)23(34)31-20-3-1-2-4-20/h5-6,11-14,16,20H,1-4,7-10,15H2,(H,31,34)(H,32,35)
US Patent
n/an/an/an/a 0.800n/an/an/a37
ACTELION PHARMACEUTICALS LTD
US Patent
Assay Description
CHO-K1 CXCR7 b-arrestin cells are detached from culture dishes with a cell dissociation buffer (Invitrogen, #13151-014) and collected in growing medi...
US Patent US9428456 (2016)
BindingDB Entry DOI: 10.7270/Q29022PZ