null
SMILES: CC(C)(C)NC(=O)C1CCN(Cc2cccc(NC(=O)c3ccc(Cl)cc3)c2)CC1
InChI Key: InChIKey=ZHUNJCCNVRXBLL-UHFFFAOYSA-N
Activity Spreadsheet -- Enzyme Inhibition Constant Data from BindingDB
Found 1 hit for monomerid = 243801
Trg + Lig
Ki
nM
ΔG°
kcal/mole
IC50
nM
Kd
nM
EC50/IC50
nM
koff
s-1
kon
M-1s-1
pHTemp
°C
Atypical chemokine receptor 3
(Homo sapiens (Human))
BDBM243801
(US9428456, 2.004)
Show SMILES CC(C)(C)NC(=O)C1CCN(Cc2cccc(NC(=O)c3ccc(Cl)cc3)c2)CC1
Show InChI InChI=1S/C24H30ClN3O2/c1-24(2,3)27-23(30)19-11-13-28(14-12-19)16-17-5-4-6-21(15-17)26-22(29)18-7-9-20(25)10-8-18/h4-10,15,19H,11-14,16H2,1-3H3,(H,26,29)(H,27,30)
US Patent
n/an/an/an/a 1n/an/an/a37
ACTELION PHARMACEUTICALS LTD
US Patent
Assay Description
CHO-K1 CXCR7 b-arrestin cells are detached from culture dishes with a cell dissociation buffer (Invitrogen, #13151-014) and collected in growing medi...
US Patent US9428456 (2016)
BindingDB Entry DOI: 10.7270/Q29022PZ