null
SMILES: Clc1ccc(cc1)C(=O)Nc1cccc(CN2CCC(CC2)C(=O)NC2CCC2)c1
InChI Key: InChIKey=ZVWLFTZYGAAFBM-UHFFFAOYSA-N
Activity Spreadsheet -- Enzyme Inhibition Constant Data from BindingDB
Found 1 hit for monomerid = 243804
Trg + Lig
Ki
nM
ΔG°
kcal/mole
IC50
nM
Kd
nM
EC50/IC50
nM
koff
s-1
kon
M-1s-1
pHTemp
°C
Atypical chemokine receptor 3
(Homo sapiens (Human))
BDBM243804
(US9428456, 2.007)
Show SMILES Clc1ccc(cc1)C(=O)Nc1cccc(CN2CCC(CC2)C(=O)NC2CCC2)c1
Show InChI InChI=1S/C24H28ClN3O2/c25-20-9-7-18(8-10-20)23(29)27-22-6-1-3-17(15-22)16-28-13-11-19(12-14-28)24(30)26-21-4-2-5-21/h1,3,6-10,15,19,21H,2,4-5,11-14,16H2,(H,26,30)(H,27,29)
US Patent
n/an/an/an/a 1n/an/an/a37
ACTELION PHARMACEUTICALS LTD
US Patent
Assay Description
CHO-K1 CXCR7 b-arrestin cells are detached from culture dishes with a cell dissociation buffer (Invitrogen, #13151-014) and collected in growing medi...
US Patent US9428456 (2016)
BindingDB Entry DOI: 10.7270/Q29022PZ