null
SMILES: CC(C)(C)NC(=O)C1CCN(Cc2cccc(NC(=O)c3cncc(c3)C(F)(F)F)c2)CC1
InChI Key: InChIKey=TULARJHXONUZOE-UHFFFAOYSA-N
Activity Spreadsheet -- Enzyme Inhibition Constant Data from BindingDB
Found 1 hit for monomerid = 243892
Trg + Lig
Ki
nM
ΔG°
kcal/mole
IC50
nM
Kd
nM
EC50/IC50
nM
koff
s-1
kon
M-1s-1
pHTemp
°C
Atypical chemokine receptor 3
(Homo sapiens (Human))
BDBM243892
(US9428456, 1.230)
Show SMILES CC(C)(C)NC(=O)C1CCN(Cc2cccc(NC(=O)c3cncc(c3)C(F)(F)F)c2)CC1
Show InChI InChI=1S/C24H29F3N4O2/c1-23(2,3)30-22(33)17-7-9-31(10-8-17)15-16-5-4-6-20(11-16)29-21(32)18-12-19(14-28-13-18)24(25,26)27/h4-6,11-14,17H,7-10,15H2,1-3H3,(H,29,32)(H,30,33)
US Patent
n/an/an/an/a 1n/an/an/a37
ACTELION PHARMACEUTICALS LTD
US Patent
Assay Description
CHO-K1 CXCR7 b-arrestin cells are detached from culture dishes with a cell dissociation buffer (Invitrogen, #13151-014) and collected in growing medi...
US Patent US9428456 (2016)
BindingDB Entry DOI: 10.7270/Q29022PZ