BDBM244121 US9428492, 4::US9428492, 4a::US9428492, 4b
SMILES: CCC(O)c1nc(C)nn1-c1cc(nc(C)n1)N1CC(C1)c1nc2ccccc2n1C
InChI Key: InChIKey=WSLFTXBMJFPNHV-UHFFFAOYSA-N
Data: 3 KI  1 IC50
Activity Spreadsheet -- Enzyme Inhibition Constant Data from BindingDB
Found 4 hits for monomerid = 244121
Trg + Lig
Ki
nM
ΔG°
kcal/mole
IC50
nM
Kd
nM
EC50/IC50
nM
koff
s-1
kon
M-1s-1
pHTemp
°C
cAMP and cAMP-inhibited cGMP 3',5'-cyclic phosphodiesterase 10A (PDE10A2)
(Homo sapiens (Human))
BDBM244121
(US9428492, 4 | US9428492, 4a | US9428492, 4b)
Show SMILES CCC(O)c1nc(C)nn1-c1cc(nc(C)n1)N1CC(C1)c1nc2ccccc2n1C
Show InChI InChI=1S/C22H26N8O/c1-5-18(31)22-25-14(3)27-30(22)20-10-19(23-13(2)24-20)29-11-15(12-29)21-26-16-8-6-7-9-17(16)28(21)4/h6-10,15,18,31H,5,11-12H2,1-4H3
US Patent
0.410 -12.8n/an/an/an/an/a7.225
Merck Sharp & Dohme Corp.
US Patent
Assay Description
The fluorescence polarization assay for cyclic nucleotide phosphodiesterases was performed using an IMAP® FP kit supplied by Molecular Devices, S...
US Patent US9428492 (2016)
BindingDB Entry DOI: 10.7270/Q2HD7TKM
cAMP and cAMP-inhibited cGMP 3',5'-cyclic phosphodiesterase 10A (PDE10A2)
(Homo sapiens (Human))
BDBM244121
(US9428492, 4 | US9428492, 4a | US9428492, 4b)
Show SMILES CCC(O)c1nc(C)nn1-c1cc(nc(C)n1)N1CC(C1)c1nc2ccccc2n1C
Show InChI InChI=1S/C22H26N8O/c1-5-18(31)22-25-14(3)27-30(22)20-10-19(23-13(2)24-20)29-11-15(12-29)21-26-16-8-6-7-9-17(16)28(21)4/h6-10,15,18,31H,5,11-12H2,1-4H3
US Patent
0.510 -12.7n/an/an/an/an/a7.225
Merck Sharp & Dohme Corp.
US Patent
Assay Description
The fluorescence polarization assay for cyclic nucleotide phosphodiesterases was performed using an IMAP® FP kit supplied by Molecular Devices, S...
US Patent US9428492 (2016)
BindingDB Entry DOI: 10.7270/Q2HD7TKM
cAMP and cAMP-inhibited cGMP 3',5'-cyclic phosphodiesterase 10A (PDE10A2)
(Homo sapiens (Human))
BDBM244121
(US9428492, 4 | US9428492, 4a | US9428492, 4b)
Show SMILES CCC(O)c1nc(C)nn1-c1cc(nc(C)n1)N1CC(C1)c1nc2ccccc2n1C
Show InChI InChI=1S/C22H26N8O/c1-5-18(31)22-25-14(3)27-30(22)20-10-19(23-13(2)24-20)29-11-15(12-29)21-26-16-8-6-7-9-17(16)28(21)4/h6-10,15,18,31H,5,11-12H2,1-4H3
US Patent
1.80 -11.9n/an/an/an/an/a7.225
Merck Sharp & Dohme Corp.
US Patent
Assay Description
The fluorescence polarization assay for cyclic nucleotide phosphodiesterases was performed using an IMAP® FP kit supplied by Molecular Devices, S...
US Patent US9428492 (2016)
BindingDB Entry DOI: 10.7270/Q2HD7TKM
Cytochrome P450 2C9
(Homo sapiens (Human))
BDBM244121
(US9428492, 4 | US9428492, 4a | US9428492, 4b)
Show SMILES CCC(O)c1nc(C)nn1-c1cc(nc(C)n1)N1CC(C1)c1nc2ccccc2n1C
Show InChI InChI=1S/C22H26N8O/c1-5-18(31)22-25-14(3)27-30(22)20-10-19(23-13(2)24-20)29-11-15(12-29)21-26-16-8-6-7-9-17(16)28(21)4/h6-10,15,18,31H,5,11-12H2,1-4H3
Reactome pathway
US Patent
n/an/a>5.00E+4n/an/an/an/an/an/a
Merck Sharp & Dohme Corp.
US Patent
Assay Description
Inhibition assay using CYP2C9
US Patent US9428492 (2016)
BindingDB Entry DOI: 10.7270/Q2HD7TKM