BDBM244154 US9428492, 21
SMILES: CC(C)C(O)c1nc(C)nn1-c1cc(nc(C)n1)C1C[C@H]1c1nc2ccccc2n1C
InChI Key: InChIKey=QPONSQWOQBWVEK-ZGOJQLDESA-N
Data: 1 KI
Activity Spreadsheet -- Enzyme Inhibition Constant Data from BindingDB
Found 1 hit for monomerid = 244154
Trg + Lig
Ki
nM
ΔG°
kcal/mole
IC50
nM
Kd
nM
EC50/IC50
nM
koff
s-1
kon
M-1s-1
pHTemp
°C
Phosphodiesterase 10A (PDE10A2)
(Homo sapiens (Human))
BDBM244154
(US9428492, 21)
Show SMILES CC(C)C(O)c1nc(C)nn1-c1cc(nc(C)n1)C1C[C@H]1c1nc2ccccc2n1C |r|
Show InChI InChI=1S/C23H27N7O/c1-12(2)21(31)23-26-14(4)28-30(23)20-11-18(24-13(3)25-20)15-10-16(15)22-27-17-8-6-7-9-19(17)29(22)5/h6-9,11-12,15-16,21,31H,10H2,1-5H3/t15?,16-,21?/m1/s1
US Patent
0.470 -12.7n/an/an/an/an/a7.225
Merck Sharp & Dohme Corp.
US Patent
Assay Description
The fluorescence polarization assay for cyclic nucleotide phosphodiesterases was performed using an IMAP® FP kit supplied by Molecular Devices, S...
US Patent US9428492 (2016)
BindingDB Entry DOI: 10.7270/Q2HD7TKM