BDBM24484 4-{[6-(furan-2-yl)-[1,2,4]triazolo[4,3-a]pyridazin-3-yl]methoxy}-7-methoxyquinoline::Triazolopyridazine, 10n::US9066954, 214
SMILES: COc1ccc2c(OCc3nnc4ccc(nn34)-c3ccco3)ccnc2c1
InChI Key: InChIKey=GQWWLPVCCXCECH-UHFFFAOYSA-N
Data: 1 KI  1 IC50
Activity Spreadsheet -- Enzyme Inhibition Constant Data from BindingDB
Found 2 hits for monomerid = 24484
Trg + Lig
Ki
nM
ΔG°
kcal/mole
IC50
nM
Kd
nM
EC50/IC50
nM
koff
s-1
kon
M-1s-1
pHTemp
°C
Hepatocyte growth factor receptor
(Homo sapiens (Human))
BDBM24484
(4-{[6-(furan-2-yl)-[1,2,4]triazolo[4,3-a]pyridazin...)
Show SMILES COc1ccc2c(OCc3nnc4ccc(nn34)-c3ccco3)ccnc2c1
Show InChI InChI=1S/C20H15N5O3/c1-26-13-4-5-14-16(11-13)21-9-8-17(14)28-12-20-23-22-19-7-6-15(24-25(19)20)18-3-2-10-27-18/h2-11H,12H2,1H3
US Patent
17.6 -10.6n/an/an/an/an/a8.027
Amgen Inc.
US Patent
Assay Description
A PCR product covering residues 1058-1365 of c-Met (c-Met kinase domain) is generated from Human Liver QuickClone cDNA (Invitrogen) using forward pri...
US Patent US9066954 (2015)
BindingDB Entry DOI: 10.7270/Q2N878JD
Hepatocyte growth factor receptor
(Homo sapiens (Human))
BDBM24484
(4-{[6-(furan-2-yl)-[1,2,4]triazolo[4,3-a]pyridazin...)
Show SMILES COc1ccc2c(OCc3nnc4ccc(nn34)-c3ccco3)ccnc2c1
Show InChI InChI=1S/C20H15N5O3/c1-26-13-4-5-14-16(11-13)21-9-8-17(14)28-12-20-23-22-19-7-6-15(24-25(19)20)18-3-2-10-27-18/h2-11H,12H2,1H3
n/an/a 29n/an/an/an/a7.422
Amgen
Assay Description
In vitro kinase assays were done to establish IC50 values against recombinant enzymes using homogeneous time-resolved fluorescence (HTRF) assay. Mole...
J Med Chem 51: 2879-82 (2008)
Article DOI: 10.1021/jm800043g
BindingDB Entry DOI: 10.7270/Q29P2ZZ6